BDBM29098 dibenzothiazepine, 12e
SMILES: CCCCNC(=O)c1ccc2Sc3ccccc3C(=Nc2c1)c1ccc(Cl)cc1
InChI Key: InChIKey=MTEFLXYKMHWTNG-UHFFFAOYSA-N
Data: 1 KI  1 Other
Activity Spreadsheet -- Enzyme Inhibition Constant Data from BindingDB
Found 2 hits for monomerid = 29098
Trg + Lig
Ki
nM
ΔG°
kcal/mole
IC50
nM
Kd
nM
EC50/IC50
nM
koff
s-1
kon
M-1s-1
pHTemp
°C
Cannabinoid receptor 1
(Homo sapiens (Human))
BDBM29098
(dibenzothiazepine, 12e)
Show SMILES CCCCNC(=O)c1ccc2Sc3ccccc3C(=Nc2c1)c1ccc(Cl)cc1 |c:19|
Show InChI InChI=1S/C24H21ClN2OS/c1-2-3-14-26-24(28)17-10-13-22-20(15-17)27-23(16-8-11-18(25)12-9-16)19-6-4-5-7-21(19)29-22/h4-13,15H,2-3,14H2,1H3,(H,26,28)
NCI pathway
Reactome pathway
0.200 -13.1n/an/an/an/an/a7.222
ACADIA Pharmaceuticals AB
Assay Description
IC50 values for test compounds were determined from nonlinear regression analysis of data collected from ligand displacement experiments. The inhibit...
J Med Chem 52: 1975-82 (2009)
Article DOI: 10.1021/jm801534c
BindingDB Entry DOI: 10.7270/Q25Q4TFP
Cannabinoid receptor 2
(Homo sapiens (Human))
BDBM29098
(dibenzothiazepine, 12e)
Show SMILES CCCCNC(=O)c1ccc2Sc3ccccc3C(=Nc2c1)c1ccc(Cl)cc1 |c:19|
Show InChI InChI=1S/C24H21ClN2OS/c1-2-3-14-26-24(28)17-10-13-22-20(15-17)27-23(16-8-11-18(25)12-9-16)19-6-4-5-7-21(19)29-22/h4-13,15H,2-3,14H2,1H3,(H,26,28)
Reactome pathway
n/an/an/an/an/an/an/a7.222
ACADIA Pharmaceuticals AB
Assay Description
IC50 values for test compounds were determined from nonlinear regression analysis of data collected from ligand displacement experiments. The inhibit...
J Med Chem 52: 1975-82 (2009)
Article DOI: 10.1021/jm801534c
BindingDB Entry DOI: 10.7270/Q25Q4TFP