BDBM290999 (R)-2-(2-amino-3-ethoxypropylamino)-4-(1H-indol-4-ylamino)pyrimidine-5-carboxamide::US9579320, Example 444
SMILES: CCOC[C@H](N)CNc1ncc(C(N)=O)c(Nc2cccc3[nH]ccc23)n1
InChI Key:
Data: 1 IC50
Activity Spreadsheet -- Enzyme Inhibition Constant Data from BindingDB
Found 1 hit for monomerid = 290999
Trg + Lig
Ki
nM
ΔG°
kcal/mole
IC50
nM
Kd
nM
EC50/IC50
nM
koff
s-1
kon
M-1s-1
pHTemp
°C
Tyrosine-protein kinase SYK
(Homo sapiens (Human))
BDBM290999
((R)-2-(2-amino-3-ethoxypropylamino)-4-(1H-indol-4-...)
Show SMILES CCOC[C@H](N)CNc1ncc(C(N)=O)c(Nc2cccc3[nH]ccc23)n1 |r|
NCI pathway
Reactome pathway
US Patent
n/an/a 5.5n/an/an/an/a7.525
Portola Pharmaceuticals, Inc.
US Patent
Assay Description
Potency of candidate molecules for inhibiting syk tyrosine phosphorylation activity is assessed by measuring the ability of a test compound to inhibi...
US Patent US9579320 (2017)
BindingDB Entry DOI: 10.7270/Q2K07692