BDBM29100 dibenzothiazepine, 12h
SMILES: CCCCNC(=O)c1ccc2Sc3ccccc3C(=Nc2c1)c1ccc(F)c(Cl)c1
InChI Key: InChIKey=OHOQFGDSEWQDAX-UHFFFAOYSA-N
Data: 2 KI
Activity Spreadsheet -- Enzyme Inhibition Constant Data from BindingDB
Found 2 hits for monomerid = 29100
Trg + Lig
Ki
nM
ΔG°
kcal/mole
IC50
nM
Kd
nM
EC50/IC50
nM
koff
s-1
kon
M-1s-1
pHTemp
°C
Cannabinoid receptor 1
(Homo sapiens (Human))
BDBM29100
(dibenzothiazepine, 12h)
Show SMILES CCCCNC(=O)c1ccc2Sc3ccccc3C(=Nc2c1)c1ccc(F)c(Cl)c1 |c:19|
Show InChI InChI=1S/C24H20ClFN2OS/c1-2-3-12-27-24(29)16-9-11-22-20(14-16)28-23(15-8-10-19(26)18(25)13-15)17-6-4-5-7-21(17)30-22/h4-11,13-14H,2-3,12H2,1H3,(H,27,29)
NCI pathway
Reactome pathway
0.200 -13.1n/an/an/an/an/a7.222
ACADIA Pharmaceuticals AB
Assay Description
IC50 values for test compounds were determined from nonlinear regression analysis of data collected from ligand displacement experiments. The inhibit...
J Med Chem 52: 1975-82 (2009)
Article DOI: 10.1021/jm801534c
BindingDB Entry DOI: 10.7270/Q25Q4TFP
Cannabinoid receptor 2
(Homo sapiens (Human))
BDBM29100
(dibenzothiazepine, 12h)
Show SMILES CCCCNC(=O)c1ccc2Sc3ccccc3C(=Nc2c1)c1ccc(F)c(Cl)c1 |c:19|
Show InChI InChI=1S/C24H20ClFN2OS/c1-2-3-12-27-24(29)16-9-11-22-20(14-16)28-23(15-8-10-19(26)18(25)13-15)17-6-4-5-7-21(17)30-22/h4-11,13-14H,2-3,12H2,1H3,(H,27,29)
Reactome pathway
1.00E+3 -8.10n/an/an/an/an/a7.222
ACADIA Pharmaceuticals AB
Assay Description
IC50 values for test compounds were determined from nonlinear regression analysis of data collected from ligand displacement experiments. The inhibit...
J Med Chem 52: 1975-82 (2009)
Article DOI: 10.1021/jm801534c
BindingDB Entry DOI: 10.7270/Q25Q4TFP