null
SMILES: CN1C(=N)N[C@@]2(CCOc3ccc(NC(=O)c4noc(C)n4)cc23)CS1(=O)=O
InChI Key: InChIKey=PGVLFIVJUHFIGL-INIZCTEOSA-N
Activity Spreadsheet -- Enzyme Inhibition Constant Data from BindingDB
Found 2 hits for monomerid = 291125
Trg + Lig
Ki
nM
ΔG°
kcal/mole
IC50
nM
Kd
nM
EC50/IC50
nM
koff
s-1
kon
M-1s-1
pHTemp
°C
Beta-secretase 2
(Homo sapiens (Human))
BDBM291125
(US9580396, Example 2q)
Show SMILES CN1C(=N)N[C@@]2(CCOc3ccc(NC(=O)c4noc(C)n4)cc23)CS1(=O)=O |r|
Show InChI InChI=1S/C16H18N6O5S/c1-9-18-13(21-27-9)14(23)19-10-3-4-12-11(7-10)16(5-6-26-12)8-28(24,25)22(2)15(17)20-16/h3-4,7H,5-6,8H2,1-2H3,(H2,17,20)(H,19,23)/t16-/m0/s1
US Patent
31n/an/an/an/an/an/a5.0n/a
Merck Sharp & Dohme Corp.
US Patent
Assay Description
Inhibitor IC50s at purified human autoBACE-2 are determined in a time-resolved endpoint proteolysis assay that measures hydrolysis of the QSY7-EISEVN...
US Patent US9580396 (2017)
BindingDB Entry DOI: 10.7270/Q29K4D9S
Beta-secretase 1
(Homo sapiens (Human))
BDBM291125
(US9580396, Example 2q)
Show SMILES CN1C(=N)N[C@@]2(CCOc3ccc(NC(=O)c4noc(C)n4)cc23)CS1(=O)=O |r|
Show InChI InChI=1S/C16H18N6O5S/c1-9-18-13(21-27-9)14(23)19-10-3-4-12-11(7-10)16(5-6-26-12)8-28(24,25)22(2)15(17)20-16/h3-4,7H,5-6,8H2,1-2H3,(H2,17,20)(H,19,23)/t16-/m0/s1
US Patent
367n/an/an/an/an/an/a5.0n/a
Merck Sharp & Dohme Corp.
US Patent
Assay Description
A homogeneous time-resolved FRET assay can be used to determine IC50 values for inhibitors of the soluble human BACE1 catalytic domain. This assay mo...
US Patent US9580396 (2017)
BindingDB Entry DOI: 10.7270/Q29K4D9S