BDBM291140 US9580396, Example 5c
SMILES: CN1C(=N)N[C@@]2(CCCc3ccc(NC(=O)c4ccc(OC(F)F)cn4)cc23)CS1(=O)=O
InChI Key: InChIKey=BPGQNORYVWVOAC-FQEVSTJZSA-N
Data: 2 KI
Activity Spreadsheet -- Enzyme Inhibition Constant Data from BindingDB
Found 2 hits for monomerid = 291140
Trg + Lig
Ki
nM
ΔG°
kcal/mole
IC50
nM
Kd
nM
EC50/IC50
nM
koff
s-1
kon
M-1s-1
pHTemp
°C
Beta-secretase 1
(Homo sapiens (Human))
BDBM291140
(US9580396, Example 5c)
Show SMILES CN1C(=N)N[C@@]2(CCCc3ccc(NC(=O)c4ccc(OC(F)F)cn4)cc23)CS1(=O)=O |r|
Show InChI InChI=1S/C20H21F2N5O4S/c1-27-19(23)26-20(11-32(27,29)30)8-2-3-12-4-5-13(9-15(12)20)25-17(28)16-7-6-14(10-24-16)31-18(21)22/h4-7,9-10,18H,2-3,8,11H2,1H3,(H2,23,26)(H,25,28)/t20-/m0/s1
US Patent
59n/an/an/an/an/an/a5.0n/a
Merck Sharp & Dohme Corp.
US Patent
Assay Description
A homogeneous time-resolved FRET assay can be used to determine IC50 values for inhibitors of the soluble human BACE1 catalytic domain. This assay mo...
US Patent US9580396 (2017)
BindingDB Entry DOI: 10.7270/Q29K4D9S
Beta-secretase 2
(Homo sapiens (Human))
BDBM291140
(US9580396, Example 5c)
Show SMILES CN1C(=N)N[C@@]2(CCCc3ccc(NC(=O)c4ccc(OC(F)F)cn4)cc23)CS1(=O)=O |r|
Show InChI InChI=1S/C20H21F2N5O4S/c1-27-19(23)26-20(11-32(27,29)30)8-2-3-12-4-5-13(9-15(12)20)25-17(28)16-7-6-14(10-24-16)31-18(21)22/h4-7,9-10,18H,2-3,8,11H2,1H3,(H2,23,26)(H,25,28)/t20-/m0/s1
US Patent
126n/an/an/an/an/an/a5.0n/a
Merck Sharp & Dohme Corp.
US Patent
Assay Description
Inhibitor IC50s at purified human autoBACE-2 are determined in a time-resolved endpoint proteolysis assay that measures hydrolysis of the QSY7-EISEVN...
US Patent US9580396 (2017)
BindingDB Entry DOI: 10.7270/Q29K4D9S