null
SMILES: CN(CC(F)(F)F)C(=O)c1cccc(Nc2c(NC(C3CCCS3)c3ccc(C)o3)c(=O)c2=O)c1O
InChI Key: InChIKey=KBLOFZHBIDLNIS-UHFFFAOYSA-N
Activity Spreadsheet -- Enzyme Inhibition Constant Data from BindingDB
Found 4 hits for monomerid = 291179
Trg + Lig
Ki
nM
ΔG°
kcal/mole
IC50
nM
Kd
nM
EC50/IC50
nM
koff
s-1
kon
M-1s-1
pHTemp
°C
C-X-C chemokine receptor type 1
(Homo sapiens (Human))
BDBM291179
(2-hydroxy-N-methyl-3-(2-{[(S)-(5-methylfuran-2-yl)...)
Show SMILES CN(CC(F)(F)F)C(=O)c1cccc(Nc2c(NC(C3CCCS3)c3ccc(C)o3)c(=O)c2=O)c1O
Show InChI InChI=1S/C24H24F3N3O5S/c1-12-8-9-15(35-12)17(16-7-4-10-36-16)29-19-18(21(32)22(19)33)28-14-6-3-5-13(20(14)31)23(34)30(2)11-24(25,26)27/h3,5-6,8-9,16-17,28-29,31H,4,7,10-11H2,1-2H3
US Patent
n/an/a 85n/an/an/an/an/an/a
GALDERMA RESEARCH & DEVELOPMENT
US Patent
Assay Description
The in vitro affinity of the compounds of the present invention for the CXCR1 and CXCR2 receptors was determined on a functional test of the β-a...
US Patent US9580412 (2017)
BindingDB Entry DOI: 10.7270/Q2222WT6
C-X-C chemokine receptor type 2
(Homo sapiens (Human))
BDBM291179
(2-hydroxy-N-methyl-3-(2-{[(S)-(5-methylfuran-2-yl)...)
Show SMILES CN(CC(F)(F)F)C(=O)c1cccc(Nc2c(NC(C3CCCS3)c3ccc(C)o3)c(=O)c2=O)c1O
Show InChI InChI=1S/C24H24F3N3O5S/c1-12-8-9-15(35-12)17(16-7-4-10-36-16)29-19-18(21(32)22(19)33)28-14-6-3-5-13(20(14)31)23(34)30(2)11-24(25,26)27/h3,5-6,8-9,16-17,28-29,31H,4,7,10-11H2,1-2H3
Reactome pathway
US Patent
n/an/a 115n/an/an/an/an/an/a
GALDERMA RESEARCH & DEVELOPMENT
US Patent
Assay Description
The in vitro affinity of the compounds of the present invention for the CXCR1 and CXCR2 receptors was determined on a functional test of the β-a...
US Patent US9580412 (2017)
BindingDB Entry DOI: 10.7270/Q2222WT6
C-X-C chemokine receptor type 1
(Homo sapiens (Human))
BDBM291179
(2-hydroxy-N-methyl-3-(2-{[(S)-(5-methylfuran-2-yl)...)
Show SMILES CN(CC(F)(F)F)C(=O)c1cccc(Nc2c(NC(C3CCCS3)c3ccc(C)o3)c(=O)c2=O)c1O
Show InChI InChI=1S/C24H24F3N3O5S/c1-12-8-9-15(35-12)17(16-7-4-10-36-16)29-19-18(21(32)22(19)33)28-14-6-3-5-13(20(14)31)23(34)30(2)11-24(25,26)27/h3,5-6,8-9,16-17,28-29,31H,4,7,10-11H2,1-2H3
US Patent
n/an/a 508n/an/an/an/an/an/a
GALDERMA RESEARCH & DEVELOPMENT
US Patent
Assay Description
The in vitro affinity of the compounds of the present invention for the CXCR1 and CXCR2 receptors was determined on a functional test of the β-a...
US Patent US9580412 (2017)
BindingDB Entry DOI: 10.7270/Q2222WT6
C-X-C chemokine receptor type 2
(Homo sapiens (Human))
BDBM291179
(2-hydroxy-N-methyl-3-(2-{[(S)-(5-methylfuran-2-yl)...)
Show SMILES CN(CC(F)(F)F)C(=O)c1cccc(Nc2c(NC(C3CCCS3)c3ccc(C)o3)c(=O)c2=O)c1O
Show InChI InChI=1S/C24H24F3N3O5S/c1-12-8-9-15(35-12)17(16-7-4-10-36-16)29-19-18(21(32)22(19)33)28-14-6-3-5-13(20(14)31)23(34)30(2)11-24(25,26)27/h3,5-6,8-9,16-17,28-29,31H,4,7,10-11H2,1-2H3
Reactome pathway
US Patent
n/an/a 47n/an/an/an/an/an/a
GALDERMA RESEARCH & DEVELOPMENT
US Patent
Assay Description
The in vitro affinity of the compounds of the present invention for the CXCR1 and CXCR2 receptors was determined on a functional test of the β-a...
US Patent US9580412 (2017)
BindingDB Entry DOI: 10.7270/Q2222WT6