BDBM29132 thiazole, 29
SMILES: OC(=O)CCNC(=O)c1ccc(CC(c2nc(cs2)-c2ccc(Cl)cc2)c2ccc(OC(F)(F)F)cc2)cc1
InChI Key: InChIKey=DRBYFBHVRFFBIU-UHFFFAOYSA-N
Data: 2 IC50
Activity Spreadsheet -- Enzyme Inhibition Constant Data from BindingDB
Found 2 hits for monomerid = 29132
Trg + Lig
Ki
nM
ΔG°
kcal/mole
IC50
nM
Kd
nM
EC50/IC50
nM
koff
s-1
kon
M-1s-1
pHTemp
°C
Gastric Inhibitory Polypeptide Receptor (GIPR)
(Homo sapiens (Human))
BDBM29132
(thiazole, 29)
Show SMILES OC(=O)CCNC(=O)c1ccc(CC(c2nc(cs2)-c2ccc(Cl)cc2)c2ccc(OC(F)(F)F)cc2)cc1
Show InChI InChI=1S/C28H22ClF3N2O4S/c29-21-9-5-19(6-10-21)24-16-39-27(34-24)23(18-7-11-22(12-8-18)38-28(30,31)32)15-17-1-3-20(4-2-17)26(37)33-14-13-25(35)36/h1-12,16,23H,13-15H2,(H,33,37)(H,35,36)
Reactome pathway
n/an/a 316n/an/an/an/an/an/a
Novo Nordisk A/S
Assay Description
Wheat Germ Agglutinin derivatized SPA beads containing a scintillant (WGA beads) (Amersham) bound the membranes of BHK cells transfected with the hum...
J Med Chem 52: 2989-3000 (2009)
Article DOI: 10.1021/jm8016249
BindingDB Entry DOI: 10.7270/Q21Z42RS
Glucagon receptor
(Homo sapiens (Human))
BDBM29132
(thiazole, 29)
Show SMILES OC(=O)CCNC(=O)c1ccc(CC(c2nc(cs2)-c2ccc(Cl)cc2)c2ccc(OC(F)(F)F)cc2)cc1
Show InChI InChI=1S/C28H22ClF3N2O4S/c29-21-9-5-19(6-10-21)24-16-39-27(34-24)23(18-7-11-22(12-8-18)38-28(30,31)32)15-17-1-3-20(4-2-17)26(37)33-14-13-25(35)36/h1-12,16,23H,13-15H2,(H,33,37)(H,35,36)
n/an/a 98n/an/an/an/a7.522
Novo Nordisk A/S
Assay Description
Wheat Germ Agglutinin derivatized SPA beads containing a scintillant (WGA beads) (Amersham) bound the membranes of BHK cells transfected with the hum...
J Med Chem 52: 2989-3000 (2009)
Article DOI: 10.1021/jm8016249
BindingDB Entry DOI: 10.7270/Q21Z42RS