BDBM291880 8-(1,3-dimethyl-1H-pyrazol-4-yl)-N-((5-fluoro-2,3-dihydrobenzofuran-4-yl)methyl)-[1,2,4]triazolo[4,3-c]pyrimidin-5-amine::US9580437, Example 195
SMILES: Cc1nn(C)cc1-c1cnc(NCc2c3CCOc3ccc2F)n2cnnc12
InChI Key: InChIKey=HIOYDIJURIUQHD-UHFFFAOYSA-N
Data: 3 IC50
Activity Spreadsheet -- Enzyme Inhibition Constant Data from BindingDB
Found 6 hits for monomerid = 291880
Trg + Lig
Ki
nM
ΔG°
kcal/mole
IC50
nM
Kd
nM
EC50/IC50
nM
koff
s-1
kon
M-1s-1
pHTemp
°C
Polycomb Repressive Complex 2 (PRC2)
(Homo sapiens (Human))
BDBM291880
(8-(1,3-dimethyl-1H-pyrazol-4-yl)-N-((5-fluoro-2,3-...)
Show SMILES Cc1nn(C)cc1-c1cnc(NCc2c3CCOc3ccc2F)n2cnnc12
Show InChI InChI=1S/C19H18FN7O/c1-11-15(9-26(2)25-11)14-8-22-19(27-10-23-24-18(14)27)21-7-13-12-5-6-28-17(12)4-3-16(13)20/h3-4,8-10H,5-7H2,1-2H3,(H,21,22)
US Patent
n/an/a 5.90n/an/an/an/a8.0n/a
Novartis AG
US Patent
Assay Description
To assess the compounds potency in the EED-H3K27Me3 competition binding assay, compounds were serially diluted 3-fold in DMSO to obtain a total of tw...
US Patent US9580437 (2017)
BindingDB Entry DOI: 10.7270/Q24T6MD7
Polycomb Repressive Complex 2 (PRC2)
(Homo sapiens (Human))
BDBM291880
(8-(1,3-dimethyl-1H-pyrazol-4-yl)-N-((5-fluoro-2,3-...)
Show SMILES Cc1nn(C)cc1-c1cnc(NCc2c3CCOc3ccc2F)n2cnnc12
Show InChI InChI=1S/C19H18FN7O/c1-11-15(9-26(2)25-11)14-8-22-19(27-10-23-24-18(14)27)21-7-13-12-5-6-28-17(12)4-3-16(13)20/h3-4,8-10H,5-7H2,1-2H3,(H,21,22)
US Patent
n/an/a 11.6n/an/an/an/a8.0n/a
Novartis AG
US Patent
Assay Description
Representative compounds of the present disclosure were serially and separately diluted 3-fold in DMSO to obtain a total of eight or twelve concentra...
US Patent US9580437 (2017)
BindingDB Entry DOI: 10.7270/Q24T6MD7
Polycomb protein EED
(Homo sapiens (Human))
BDBM291880
(8-(1,3-dimethyl-1H-pyrazol-4-yl)-N-((5-fluoro-2,3-...)
Show SMILES Cc1nn(C)cc1-c1cnc(NCc2c3CCOc3ccc2F)n2cnnc12
Show InChI InChI=1S/C19H18FN7O/c1-11-15(9-26(2)25-11)14-8-22-19(27-10-23-24-18(14)27)21-7-13-12-5-6-28-17(12)4-3-16(13)20/h3-4,8-10H,5-7H2,1-2H3,(H,21,22)
n/an/a 2.40n/an/an/an/an/an/a
TBA
Citation and Details
Polycomb protein EED
(Homo sapiens (Human))
BDBM291880
(8-(1,3-dimethyl-1H-pyrazol-4-yl)-N-((5-fluoro-2,3-...)
Show SMILES Cc1nn(C)cc1-c1cnc(NCc2c3CCOc3ccc2F)n2cnnc12
Show InChI InChI=1S/C19H18FN7O/c1-11-15(9-26(2)25-11)14-8-22-19(27-10-23-24-18(14)27)21-7-13-12-5-6-28-17(12)4-3-16(13)20/h3-4,8-10H,5-7H2,1-2H3,(H,21,22)
n/an/a 5.90n/an/an/an/an/an/a
TBA
Citation and Details
Polycomb protein EED
(Homo sapiens (Human))
BDBM291880
(8-(1,3-dimethyl-1H-pyrazol-4-yl)-N-((5-fluoro-2,3-...)
Show SMILES Cc1nn(C)cc1-c1cnc(NCc2c3CCOc3ccc2F)n2cnnc12
Show InChI InChI=1S/C19H18FN7O/c1-11-15(9-26(2)25-11)14-8-22-19(27-10-23-24-18(14)27)21-7-13-12-5-6-28-17(12)4-3-16(13)20/h3-4,8-10H,5-7H2,1-2H3,(H,21,22)
n/an/a 11.6n/an/an/an/an/an/a
TBA
Citation and Details
Polycomb Repressive Complex 2 (PRC2)
(Homo sapiens (Human))
BDBM291880
(8-(1,3-dimethyl-1H-pyrazol-4-yl)-N-((5-fluoro-2,3-...)
Show SMILES Cc1nn(C)cc1-c1cnc(NCc2c3CCOc3ccc2F)n2cnnc12
Show InChI InChI=1S/C19H18FN7O/c1-11-15(9-26(2)25-11)14-8-22-19(27-10-23-24-18(14)27)21-7-13-12-5-6-28-17(12)4-3-16(13)20/h3-4,8-10H,5-7H2,1-2H3,(H,21,22)
US Patent
n/an/a 2.40n/an/an/an/an/an/a
Novartis AG
US Patent
Assay Description
Cell lysates were transferred to the wells of a 384-well plate and the final volume was adjusted to 50 μL per well with PBS. The plate was seale...
US Patent US9580437 (2017)
BindingDB Entry DOI: 10.7270/Q24T6MD7