null
SMILES: COc1cc(CNC=O)c(C)cc1Nc1ncc(Cl)c(Nc2ccccc2S(=O)(=O)C(C)C)n1
InChI Key: InChIKey=JKEFKVZKYKUDGL-UHFFFAOYSA-N
Activity Spreadsheet -- Enzyme Inhibition Constant Data from BindingDB
Found 4 hits for monomerid = 292000
Trg + Lig
Ki
nM
ΔG°
kcal/mole
IC50
nM
Kd
nM
EC50/IC50
nM
koff
s-1
kon
M-1s-1
pHTemp
°C
ALK tyrosine kinase receptor
(Homo sapiens (Human))
BDBM292000
(US10100019, Example 71)
Show SMILES COc1cc(CNC=O)c(C)cc1Nc1ncc(Cl)c(Nc2ccccc2S(=O)(=O)C(C)C)n1
Show InChI InChI=1S/C23H26ClN5O4S/c1-14(2)34(31,32)21-8-6-5-7-18(21)27-22-17(24)12-26-23(29-22)28-19-9-15(3)16(11-25-13-30)10-20(19)33-4/h5-10,12-14H,11H2,1-4H3,(H,25,30)(H2,26,27,28,29)
US Patent
n/an/a 4.72n/an/an/an/an/a25
Korea Research Institute of Chemical Technology
US Patent
Assay Description
The following experiment was performed in order to measure the activity of the N2-(2-methoxyphenyl)pyrimidine derivative represented by formula 1 of ...
US Patent US10100019 (2018)
BindingDB Entry DOI: 10.7270/Q2125VPT
ALK tyrosine kinase receptor
(Homo sapiens (Human))
BDBM292000
(US10100019, Example 71)
Show SMILES COc1cc(CNC=O)c(C)cc1Nc1ncc(Cl)c(Nc2ccccc2S(=O)(=O)C(C)C)n1
Show InChI InChI=1S/C23H26ClN5O4S/c1-14(2)34(31,32)21-8-6-5-7-18(21)27-22-17(24)12-26-23(29-22)28-19-9-15(3)16(11-25-13-30)10-20(19)33-4/h5-10,12-14H,11H2,1-4H3,(H,25,30)(H2,26,27,28,29)
n/an/a 4.70n/an/an/an/an/an/a
Korea Research Institute of Chemical Technology
Curated by ChEMBL
Assay Description
Inhibition of wild-type ALK (unknown origin) using peptide as substrate measured after 30 mins by fluorescence assay
Eur J Med Chem 126: 536-549 (2017)
BindingDB Entry DOI: 10.7270/Q2ZW1P4Q
Insulin receptor
(Homo sapiens (Human))
BDBM292000
(US10100019, Example 71)
Show SMILES COc1cc(CNC=O)c(C)cc1Nc1ncc(Cl)c(Nc2ccccc2S(=O)(=O)C(C)C)n1
Show InChI InChI=1S/C23H26ClN5O4S/c1-14(2)34(31,32)21-8-6-5-7-18(21)27-22-17(24)12-26-23(29-22)28-19-9-15(3)16(11-25-13-30)10-20(19)33-4/h5-10,12-14H,11H2,1-4H3,(H,25,30)(H2,26,27,28,29)
US Patent
n/an/a 6n/an/an/an/an/an/a
Korea Research Institute of Chemical Technology
US Patent
Assay Description
To measure the activity of the N2-(2-methoxyphenyl)pyrimidine derivative represented by formula 1 of the present invention to inhibit anaplastic lymp...
US Patent US10100019 (2018)
BindingDB Entry DOI: 10.7270/Q2125VPT
ALK tyrosine kinase receptor [L1196M]
(Homo sapiens (Human))
BDBM292000
(US10100019, Example 71)
Show SMILES COc1cc(CNC=O)c(C)cc1Nc1ncc(Cl)c(Nc2ccccc2S(=O)(=O)C(C)C)n1
Show InChI InChI=1S/C23H26ClN5O4S/c1-14(2)34(31,32)21-8-6-5-7-18(21)27-22-17(24)12-26-23(29-22)28-19-9-15(3)16(11-25-13-30)10-20(19)33-4/h5-10,12-14H,11H2,1-4H3,(H,25,30)(H2,26,27,28,29)
US Patent
n/an/a 2.80n/an/an/an/an/an/a
Korea Research Institute of Chemical Technology
US Patent
Assay Description
To measure the activity of the N2-(2-methoxyphenyl)pyrimidine derivative represented by formula 1 of the present invention to inhibit anaplastic lymp...
US Patent US10100019 (2018)
BindingDB Entry DOI: 10.7270/Q2125VPT