BDBM29215 casimiroin analogue, 1d
SMILES: Cc1cc(=O)n(C)c2ccccc12
InChI Key: InChIKey=CEONKCOBRZOYJS-UHFFFAOYSA-N
Data: 2 IC50
PDB links: 1 PDB ID matches this monomer. 1 PDB ID contains inhibitors having a similarity of 90% to this monomer.
Activity Spreadsheet -- Enzyme Inhibition Constant Data from BindingDB
Found 2 hits for monomerid = 29215
Trg + Lig
Ki
nM
ΔG°
kcal/mole
IC50
nM
Kd
nM
EC50/IC50
nM
koff
s-1
kon
M-1s-1
pHTemp
°C
Aromatase
(Homo sapiens (Human))
BDBM29215
(casimiroin analogue, 1d)
Show SMILES Cc1cc(=O)n(C)c2ccccc12
Show InChI InChI=1S/C11H11NO/c1-8-7-11(13)12(2)10-6-4-3-5-9(8)10/h3-7H,1-2H3
Reactome pathway
n/an/a>1.16E+5n/an/an/an/an/an/a
Purdue University
Assay Description
Aromatase inhibition was quantified by measuring the fluorescent intensity of fluorescein, the hydrolysis product of dibenzylfluorescein (DBF), by ar...
J Med Chem 52: 1873-84 (2009)
Article DOI: 10.1021/jm801335z
BindingDB Entry DOI: 10.7270/Q2NP22RV
Ribosyldihydronicotinamide dehydrogenase [quinone]
(Homo sapiens (Human))
BDBM29215
(casimiroin analogue, 1d)
Show SMILES Cc1cc(=O)n(C)c2ccccc12
Show InChI InChI=1S/C11H11NO/c1-8-7-11(13)12(2)10-6-4-3-5-9(8)10/h3-7H,1-2H3
n/an/a 1.82E+4n/an/an/an/a7.523
Purdue University
Assay Description
The activity of QR2 under steady-state conditions was evaluated on SpectraMax Plus 384 UV/vis spectrophotometer by monitoring the increase in absorba...
J Med Chem 52: 1873-84 (2009)
Article DOI: 10.1021/jm801335z
BindingDB Entry DOI: 10.7270/Q2NP22RV
3D
3D Structure (crystal)