null
SMILES: CCN(CC)[C@@H](C)CNC(=O)c1cc(nc(c1)-c1cnn2ccc(nc12)-c1cccs1)N1CC(O)C1
InChI Key: InChIKey=OFBABNCAYHDFSH-KRWDZBQOSA-N
PDB links: 1 PDB ID matches this monomer.
Activity Spreadsheet -- Enzyme Inhibition Constant Data from BindingDB
Found 6 hits for monomerid = 292489
Trg + Lig
Ki
nM
ΔG°
kcal/mole
IC50
nM
Kd
nM
EC50/IC50
nM
koff
s-1
kon
M-1s-1
pHTemp
°C
Calcium/calmodulin-dependent protein kinase type II subunit delta
(Homo sapiens (Human))
BDBM292489
((S)-N-(2-(diethylamino)propyl)-2-(3-hydroxyazetidi...)
Show SMILES CCN(CC)[C@@H](C)CNC(=O)c1cc(nc(c1)-c1cnn2ccc(nc12)-c1cccs1)N1CC(O)C1 |r|
Show InChI InChI=1S/C26H31N7O2S/c1-4-31(5-2)17(3)13-27-26(35)18-11-22(29-24(12-18)32-15-19(34)16-32)20-14-28-33-9-8-21(30-25(20)33)23-7-6-10-36-23/h6-12,14,17,19,34H,4-5,13,15-16H2,1-3H3,(H,27,35)/t17-/m0/s1
US Patent
n/an/a 0.100n/an/an/an/an/an/a
Gilead Sciences, Inc.
US Patent
Assay Description
The biochemical activity of recombinant CaMKIIδ was measured by monitoring the phosphorylation of a target peptide using Homogenous Time Resolve...
US Patent US10100058 (2018)
BindingDB Entry DOI: 10.7270/Q2V98B4F
3D
3D Structure (crystal)
Calcium/calmodulin-dependent protein kinase type II subunit delta
(Homo sapiens (Human))
BDBM292489
((S)-N-(2-(diethylamino)propyl)-2-(3-hydroxyazetidi...)
Show SMILES CCN(CC)[C@@H](C)CNC(=O)c1cc(nc(c1)-c1cnn2ccc(nc12)-c1cccs1)N1CC(O)C1 |r|
Show InChI InChI=1S/C26H31N7O2S/c1-4-31(5-2)17(3)13-27-26(35)18-11-22(29-24(12-18)32-15-19(34)16-32)20-14-28-33-9-8-21(30-25(20)33)23-7-6-10-36-23/h6-12,14,17,19,34H,4-5,13,15-16H2,1-3H3,(H,27,35)/t17-/m0/s1
US Patent
n/an/an/an/a 17.7n/an/an/an/a
Gilead Sciences, Inc.
US Patent
Assay Description
CaMKII activity in neonatal rat ventricular myocytes (NRVM) was measured by monitoring the phosphorylation level of phospholamban using high-content ...
US Patent US10100058 (2018)
BindingDB Entry DOI: 10.7270/Q2V98B4F
3D
3D Structure (crystal)
1,3-beta-glucan synthase component GSC2
(Saccharomyces cerevisiae)
BDBM292489
((S)-N-(2-(diethylamino)propyl)-2-(3-hydroxyazetidi...)
Show SMILES CCN(CC)[C@@H](C)CNC(=O)c1cc(nc(c1)-c1cnn2ccc(nc12)-c1cccs1)N1CC(O)C1 |r|
Show InChI InChI=1S/C26H31N7O2S/c1-4-31(5-2)17(3)13-27-26(35)18-11-22(29-24(12-18)32-15-19(34)16-32)20-14-28-33-9-8-21(30-25(20)33)23-7-6-10-36-23/h6-12,14,17,19,34H,4-5,13,15-16H2,1-3H3,(H,27,35)/t17-/m0/s1
n/an/a>3.00E+4n/an/an/an/an/an/a
TBA
Assay Description
Inhibition of human ERG
Citation and Details
Article DOI: 10.1016/j.bmcl.2017.10.040
BindingDB Entry DOI: 10.7270/Q2930WR2
Calcium/calmodulin-dependent protein kinase type II subunit delta/gamma
(Rattus norvegicus)
BDBM292489
((S)-N-(2-(diethylamino)propyl)-2-(3-hydroxyazetidi...)
Show SMILES CCN(CC)[C@@H](C)CNC(=O)c1cc(nc(c1)-c1cnn2ccc(nc12)-c1cccs1)N1CC(O)C1 |r|
Show InChI InChI=1S/C26H31N7O2S/c1-4-31(5-2)17(3)13-27-26(35)18-11-22(29-24(12-18)32-15-19(34)16-32)20-14-28-33-9-8-21(30-25(20)33)23-7-6-10-36-23/h6-12,14,17,19,34H,4-5,13,15-16H2,1-3H3,(H,27,35)/t17-/m0/s1
NCI pathway
Reactome pathway
n/an/an/an/a 6.20n/an/an/an/a
TBA
Assay Description
Inhibition of CaMK2gamma/delta in neonatal rat ventricular myocytes assessed as phospholamban phosphorylation after 4 hrs by Hoechst 33342 fluorescen...
Citation and Details
Article DOI: 10.1016/j.bmcl.2017.10.040
BindingDB Entry DOI: 10.7270/Q2930WR2
3D
3D Structure (crystal)
Calcium/calmodulin-dependent protein kinase type II subunit beta
(Rattus norvegicus)
BDBM292489
((S)-N-(2-(diethylamino)propyl)-2-(3-hydroxyazetidi...)
Show SMILES CCN(CC)[C@@H](C)CNC(=O)c1cc(nc(c1)-c1cnn2ccc(nc12)-c1cccs1)N1CC(O)C1 |r|
Show InChI InChI=1S/C26H31N7O2S/c1-4-31(5-2)17(3)13-27-26(35)18-11-22(29-24(12-18)32-15-19(34)16-32)20-14-28-33-9-8-21(30-25(20)33)23-7-6-10-36-23/h6-12,14,17,19,34H,4-5,13,15-16H2,1-3H3,(H,27,35)/t17-/m0/s1
n/an/an/an/a 274n/an/an/an/a
TBA
Assay Description
Inhibition of CaMK2alpha/beta in neonatal rat cortical neurons assessed as phospholamban phosphorylation after 4 hrs by Hoechst 33342 fluorescence-ba...
Citation and Details
Article DOI: 10.1016/j.bmcl.2017.10.040
BindingDB Entry DOI: 10.7270/Q2930WR2
3D
3D Structure (crystal)
Calcium/calmodulin-dependent protein kinase type II subunit delta
(Homo sapiens (Human))
BDBM292489
((S)-N-(2-(diethylamino)propyl)-2-(3-hydroxyazetidi...)
Show SMILES CCN(CC)[C@@H](C)CNC(=O)c1cc(nc(c1)-c1cnn2ccc(nc12)-c1cccs1)N1CC(O)C1 |r|
Show InChI InChI=1S/C26H31N7O2S/c1-4-31(5-2)17(3)13-27-26(35)18-11-22(29-24(12-18)32-15-19(34)16-32)20-14-28-33-9-8-21(30-25(20)33)23-7-6-10-36-23/h6-12,14,17,19,34H,4-5,13,15-16H2,1-3H3,(H,27,35)/t17-/m0/s1
n/an/a 0.100n/an/an/an/an/an/a
TBA
Assay Description
Inhibition of recombinant human full length His-tagged CaMK2delta expressed in baculovirus using Biotin labelled STK1 as substrate after 1 hr in pres...
Citation and Details
Article DOI: 10.1016/j.bmcl.2017.10.040
BindingDB Entry DOI: 10.7270/Q2930WR2
3D
3D Structure (crystal)