BDBM292567 (S)-N-(2-(diethylamino)propyl)-2-((2-morpholinoethyl)amino)-6-(5-(thiophen-2-yl)pyrazolo[1,5-a]pyrimidin-3-yl)isonicotinamide::US10100058, Example 223
SMILES: CCN(CC)[C@@H](C)CNC(=O)c1cc(NCCN2CCOCC2)nc(c1)-c1cnn2ccc(nc12)-c1cccs1
InChI Key: InChIKey=REMDFKWHZGXXBB-NRFANRHFSA-N
Data: 1 IC50  1 EC50
Activity Spreadsheet -- Enzyme Inhibition Constant Data from BindingDB
Found 2 hits for monomerid = 292567
Trg + Lig
Ki
nM
ΔG°
kcal/mole
IC50
nM
Kd
nM
EC50/IC50
nM
koff
s-1
kon
M-1s-1
pHTemp
°C
Calcium/calmodulin-dependent protein kinase type II subunit delta (CAMK2D)
(Homo sapiens (Human))
BDBM292567
((S)-N-(2-(diethylamino)propyl)-2-((2-morpholinoeth...)
Show SMILES CCN(CC)[C@@H](C)CNC(=O)c1cc(NCCN2CCOCC2)nc(c1)-c1cnn2ccc(nc12)-c1cccs1 |r|
Show InChI InChI=1S/C29H38N8O2S/c1-4-36(5-2)21(3)19-31-29(38)22-17-25(33-27(18-22)30-9-11-35-12-14-39-15-13-35)23-20-32-37-10-8-24(34-28(23)37)26-7-6-16-40-26/h6-8,10,16-18,20-21H,4-5,9,11-15,19H2,1-3H3,(H,30,33)(H,31,38)/t21-/m0/s1
US Patent
n/an/an/an/a 27.5n/an/an/an/a
Gilead Sciences, Inc.
US Patent
Assay Description
CaMKII activity in neonatal rat ventricular myocytes (NRVM) was measured by monitoring the phosphorylation level of phospholamban using high-content ...
US Patent US10100058 (2018)
BindingDB Entry DOI: 10.7270/Q2V98B4F
Calcium/calmodulin-dependent protein kinase type II subunit delta (CAMK2D)
(Homo sapiens (Human))
BDBM292567
((S)-N-(2-(diethylamino)propyl)-2-((2-morpholinoeth...)
Show SMILES CCN(CC)[C@@H](C)CNC(=O)c1cc(NCCN2CCOCC2)nc(c1)-c1cnn2ccc(nc12)-c1cccs1 |r|
Show InChI InChI=1S/C29H38N8O2S/c1-4-36(5-2)21(3)19-31-29(38)22-17-25(33-27(18-22)30-9-11-35-12-14-39-15-13-35)23-20-32-37-10-8-24(34-28(23)37)26-7-6-16-40-26/h6-8,10,16-18,20-21H,4-5,9,11-15,19H2,1-3H3,(H,30,33)(H,31,38)/t21-/m0/s1
US Patent
n/an/a 0.140n/an/an/an/an/an/a
Gilead Sciences, Inc.
US Patent
Assay Description
The biochemical activity of recombinant CaMKIIδ was measured by monitoring the phosphorylation of a target peptide using Homogenous Time Resolve...
US Patent US10100058 (2018)
BindingDB Entry DOI: 10.7270/Q2V98B4F