BDBM29338 diphenol::diphenol derivative, 10
SMILES: CC(C)(c1ccc(O)cc1)c1ccc(cc1)C(C)(C)c1ccc(O)cc1
InChI Key: InChIKey=GIXXQTYGFOHYPT-UHFFFAOYSA-N
Data: 1 IC50
Activity Spreadsheet -- Enzyme Inhibition Constant Data from BindingDB
Found 1 hit for monomerid = 29338
Trg + Lig
Ki
nM
ΔG°
kcal/mole
IC50
nM
Kd
nM
EC50/IC50
nM
koff
s-1
kon
M-1s-1
pHTemp
°C
HCV NS3 Helicase
(Hepatitis C virus genotype 1b (isolate Taiwan))
BDBM29338
(diphenol | diphenol derivative, 10)
Show SMILES CC(C)(c1ccc(O)cc1)c1ccc(cc1)C(C)(C)c1ccc(O)cc1
Show InChI InChI=1S/C24H26O2/c1-23(2,19-9-13-21(25)14-10-19)17-5-7-18(8-6-17)24(3,4)20-11-15-22(26)16-12-20/h5-16,25-26H,1-4H3
n/an/a 6.07E+4n/an/an/an/a7.022
National Taiwan University
Assay Description
The enzyme was assayed the DNA helicase activity by using DNA substrate (annealed BHQ1-labeled release strand and FITC-labeled template strand) in th...
J Med Chem 52: 2716-23 (2009)
Article DOI: 10.1021/jm8011905
BindingDB Entry DOI: 10.7270/Q2RF5SBT