BDBM29352 proline scaffold, 1
SMILES: CNC(=O)[C@@H]1CCCN1C(=O)CCc1ccc(Cl)cc1
InChI Key: InChIKey=ZXLUENNDEBJIFM-ZDUSSCGKSA-N
Data: 1 IC50  1 Kd
Activity Spreadsheet -- Enzyme Inhibition Constant Data from BindingDB
Found 1 hit for monomerid = 29352
Trg + Lig
Ki
nM
ΔG°
kcal/mole
IC50
nM
Kd
nM
EC50/IC50
nM
koff
s-1
kon
M-1s-1
pHTemp
°C
Prothrombin
(Homo sapiens (Human))
BDBM29352
(proline scaffold, 1)
Show SMILES CNC(=O)[C@@H]1CCCN1C(=O)CCc1ccc(Cl)cc1 |r|
Show InChI InChI=1S/C15H19ClN2O2/c1-17-15(20)13-3-2-10-18(13)14(19)9-6-11-4-7-12(16)8-5-11/h4-5,7-8,13H,2-3,6,9-10H2,1H3,(H,17,20)/t13-/m0/s1
n/an/a>4.00E+5>1.00E+6n/an/an/a7.437
University of Kalmar
Assay Description
SPR experiments where performed with a Biacore A100 using Series S sensor chip CM5 (GE Healthcare Bio-Sciences AB, Uppsala, Sweden). The proteins wer...
J Med Chem 52: 2708-15 (2009)
Article DOI: 10.1021/jm8011849
BindingDB Entry DOI: 10.7270/Q2H130B7