null
SMILES: CCCNC(=O)[C@@H]1CCCN1C(=O)CC1(O)c2ccccc2-c2ccccc12
InChI Key: InChIKey=AQIVYCRQRUGSRD-FQEVSTJZSA-N
Activity Spreadsheet -- Enzyme Inhibition Constant Data from BindingDB
Found 1 hit for monomerid = 29365
Trg + Lig
Ki
nM
ΔG°
kcal/mole
IC50
nM
Kd
nM
EC50/IC50
nM
koff
s-1
kon
M-1s-1
pHTemp
°C
Prothrombin
(Homo sapiens (Human))
BDBM29365
(proline scaffold, 14)
Show SMILES CCCNC(=O)[C@@H]1CCCN1C(=O)CC1(O)c2ccccc2-c2ccccc12 |r|
Show InChI InChI=1S/C23H26N2O3/c1-2-13-24-22(27)20-12-7-14-25(20)21(26)15-23(28)18-10-5-3-8-16(18)17-9-4-6-11-19(17)23/h3-6,8-11,20,28H,2,7,12-15H2,1H3,(H,24,27)/t20-/m0/s1
n/an/a 3.80E+5 9.90E+4n/an/an/a7.437
University of Kalmar
Assay Description
SPR experiments where performed with a Biacore A100 using Series S sensor chip CM5 (GE Healthcare Bio-Sciences AB, Uppsala, Sweden). The proteins wer...
J Med Chem 52: 2708-15 (2009)
Article DOI: 10.1021/jm8011849
BindingDB Entry DOI: 10.7270/Q2H130B7