null
SMILES: OC1(CC(=O)N2CCC[C@H]2C(=O)NCc2cccs2)c2ccccc2-c2ccccc12
InChI Key: InChIKey=MUNZKMXBNJDCGZ-QFIPXVFZSA-N
Activity Spreadsheet -- Enzyme Inhibition Constant Data from BindingDB
Found 1 hit for monomerid = 29367
Trg + Lig
Ki
nM
ΔG°
kcal/mole
IC50
nM
Kd
nM
EC50/IC50
nM
koff
s-1
kon
M-1s-1
pHTemp
°C
Prothrombin
(Homo sapiens (Human))
BDBM29367
(proline scaffold, 16)
Show SMILES OC1(CC(=O)N2CCC[C@H]2C(=O)NCc2cccs2)c2ccccc2-c2ccccc12 |r|
Show InChI InChI=1S/C25H24N2O3S/c28-23(27-13-5-12-22(27)24(29)26-16-17-7-6-14-31-17)15-25(30)20-10-3-1-8-18(20)19-9-2-4-11-21(19)25/h1-4,6-11,14,22,30H,5,12-13,15-16H2,(H,26,29)/t22-/m0/s1
n/an/a 4.90E+4 2.30E+4n/an/an/a7.437
University of Kalmar
Assay Description
SPR experiments where performed with a Biacore A100 using Series S sensor chip CM5 (GE Healthcare Bio-Sciences AB, Uppsala, Sweden). The proteins wer...
J Med Chem 52: 2708-15 (2009)
Article DOI: 10.1021/jm8011849
BindingDB Entry DOI: 10.7270/Q2H130B7