null
SMILES: COc1ccc(cn1)N(C)c1ccc2[C@H](CNc3cnccc3C(O)=O)CCCc2c1
InChI Key: InChIKey=LZTVFZUPTNHWPT-KRWDZBQOSA-N
Activity Spreadsheet -- Enzyme Inhibition Constant Data from BindingDB
Found 1 hit for monomerid = 293671
Trg + Lig
Ki
nM
ΔG°
kcal/mole
IC50
nM
Kd
nM
EC50/IC50
nM
koff
s-1
kon
M-1s-1
pHTemp
°C
Lysine-specific demethylase 4C
(Homo sapiens (Human))
BDBM293671
(3-({[(1R)-6-[(6-methoxypyridin-3-yl)(methyl)amino]...)
Show SMILES COc1ccc(cn1)N(C)c1ccc2[C@H](CNc3cnccc3C(O)=O)CCCc2c1 |r|
Show InChI InChI=1S/C24H26N4O3/c1-28(19-7-9-23(31-2)27-14-19)18-6-8-20-16(12-18)4-3-5-17(20)13-26-22-15-25-11-10-21(22)24(29)30/h6-12,14-15,17,26H,3-5,13H2,1-2H3,(H,29,30)/t17-/m0/s1
US Patent
n/an/a 550n/an/an/an/an/a25
Celgene Quanticel Research, Inc.
US Patent
Assay Description
The ability of test compounds to inhibit the activity of JMJD2C was determined in 384-well plate format under the following reaction conditions: 0.3 ...
US Patent US10106534 (2018)
BindingDB Entry DOI: 10.7270/Q2JW8GZX