null
SMILES: CN(c1ccc(F)cc1)c1ccc2[C@H](CNc3cnccc3C(O)=O)CCOc2c1
InChI Key: InChIKey=SFPFJVQNBJLRMT-HNNXBMFYSA-N
Activity Spreadsheet -- Enzyme Inhibition Constant Data from BindingDB
Found 2 hits for monomerid = 293679
Trg + Lig
Ki
nM
ΔG°
kcal/mole
IC50
nM
Kd
nM
EC50/IC50
nM
koff
s-1
kon
M-1s-1
pHTemp
°C
Lysine-specific demethylase 6B
(Homo sapiens (Human))
BDBM293679
(3-({[(4R)-7-[(4-fluorophenyl)(methyl)amino]-3,4-di...)
Show SMILES CN(c1ccc(F)cc1)c1ccc2[C@H](CNc3cnccc3C(O)=O)CCOc2c1 |r|
Show InChI InChI=1S/C23H22FN3O3/c1-27(17-4-2-16(24)3-5-17)18-6-7-19-15(9-11-30-22(19)12-18)13-26-21-14-25-10-8-20(21)23(28)29/h2-8,10,12,14-15,26H,9,11,13H2,1H3,(H,28,29)/t15-/m0/s1
US Patent
n/an/a 5.50E+3n/an/an/an/an/a25
Celgene Quanticel Research, Inc.
US Patent
Assay Description
The enzymatic assay of JMJD3 activity is based upon Time Resolved-Fluorescence Resonance Energy Transfer (TR-FRET) detection. The ability of test com...
US Patent US10106534 (2018)
BindingDB Entry DOI: 10.7270/Q2JW8GZX
Lysine-specific demethylase 4C
(Homo sapiens (Human))
BDBM293679
(3-({[(4R)-7-[(4-fluorophenyl)(methyl)amino]-3,4-di...)
Show SMILES CN(c1ccc(F)cc1)c1ccc2[C@H](CNc3cnccc3C(O)=O)CCOc2c1 |r|
Show InChI InChI=1S/C23H22FN3O3/c1-27(17-4-2-16(24)3-5-17)18-6-7-19-15(9-11-30-22(19)12-18)13-26-21-14-25-10-8-20(21)23(28)29/h2-8,10,12,14-15,26H,9,11,13H2,1H3,(H,28,29)/t15-/m0/s1
US Patent
n/an/a 550n/an/an/an/an/a25
Celgene Quanticel Research, Inc.
US Patent
Assay Description
The ability of test compounds to inhibit the activity of JMJD2C was determined in 384-well plate format under the following reaction conditions: 0.3 ...
US Patent US10106534 (2018)
BindingDB Entry DOI: 10.7270/Q2JW8GZX