null
SMILES: CCN(c1ccccc1)c1ccc2[C@H](CNc3cnccc3C(O)=O)CCOc2c1
InChI Key: InChIKey=AAHQMDZQWCCAAA-KRWDZBQOSA-N
Activity Spreadsheet -- Enzyme Inhibition Constant Data from BindingDB
Found 2 hits for monomerid = 293682
Trg + Lig
Ki
nM
ΔG°
kcal/mole
IC50
nM
Kd
nM
EC50/IC50
nM
koff
s-1
kon
M-1s-1
pHTemp
°C
Lysine-specific demethylase 6B
(Homo sapiens (Human))
BDBM293682
(3-({[(4R)-7-[ethyl(phenyl)amino]-3,4-dihydro-2H-1-...)
Show SMILES CCN(c1ccccc1)c1ccc2[C@H](CNc3cnccc3C(O)=O)CCOc2c1 |r|
Show InChI InChI=1S/C24H25N3O3/c1-2-27(18-6-4-3-5-7-18)19-8-9-20-17(11-13-30-23(20)14-19)15-26-22-16-25-12-10-21(22)24(28)29/h3-10,12,14,16-17,26H,2,11,13,15H2,1H3,(H,28,29)/t17-/m0/s1
US Patent
n/an/a 5.50E+3n/an/an/an/an/a25
Celgene Quanticel Research, Inc.
US Patent
Assay Description
The enzymatic assay of JMJD3 activity is based upon Time Resolved-Fluorescence Resonance Energy Transfer (TR-FRET) detection. The ability of test com...
US Patent US10106534 (2018)
BindingDB Entry DOI: 10.7270/Q2JW8GZX
Lysine-specific demethylase 4C
(Homo sapiens (Human))
BDBM293682
(3-({[(4R)-7-[ethyl(phenyl)amino]-3,4-dihydro-2H-1-...)
Show SMILES CCN(c1ccccc1)c1ccc2[C@H](CNc3cnccc3C(O)=O)CCOc2c1 |r|
Show InChI InChI=1S/C24H25N3O3/c1-2-27(18-6-4-3-5-7-18)19-8-9-20-17(11-13-30-23(20)14-19)15-26-22-16-25-12-10-21(22)24(28)29/h3-10,12,14,16-17,26H,2,11,13,15H2,1H3,(H,28,29)/t17-/m0/s1
US Patent
n/an/a 550n/an/an/an/an/a25
Celgene Quanticel Research, Inc.
US Patent
Assay Description
The ability of test compounds to inhibit the activity of JMJD2C was determined in 384-well plate format under the following reaction conditions: 0.3 ...
US Patent US10106534 (2018)
BindingDB Entry DOI: 10.7270/Q2JW8GZX