null
SMILES: OC(=O)c1ccncc1NC[C@@H]1CCOc2cc(Sc3ccc(F)cc3)ccc12
InChI Key: InChIKey=KFERCOIZQGSFCJ-AWEZNQCLSA-N
Activity Spreadsheet -- Enzyme Inhibition Constant Data from BindingDB
Found 2 hits for monomerid = 293713
Trg + Lig
Ki
nM
ΔG°
kcal/mole
IC50
nM
Kd
nM
EC50/IC50
nM
koff
s-1
kon
M-1s-1
pHTemp
°C
Lysine-specific demethylase 6B
(Homo sapiens (Human))
BDBM293713
(3-({[(4R)-7-[(4-fluorophenyl)sulfanyl]-3,4-dihydro...)
Show SMILES OC(=O)c1ccncc1NC[C@@H]1CCOc2cc(Sc3ccc(F)cc3)ccc12 |r|
Show InChI InChI=1S/C22H19FN2O3S/c23-15-1-3-16(4-2-15)29-17-5-6-18-14(8-10-28-21(18)11-17)12-25-20-13-24-9-7-19(20)22(26)27/h1-7,9,11,13-14,25H,8,10,12H2,(H,26,27)/t14-/m0/s1
US Patent
n/an/a 5.50E+3n/an/an/an/an/a25
Celgene Quanticel Research, Inc.
US Patent
Assay Description
The enzymatic assay of JMJD3 activity is based upon Time Resolved-Fluorescence Resonance Energy Transfer (TR-FRET) detection. The ability of test com...
US Patent US10106534 (2018)
BindingDB Entry DOI: 10.7270/Q2JW8GZX
Lysine-specific demethylase 4C
(Homo sapiens (Human))
BDBM293713
(3-({[(4R)-7-[(4-fluorophenyl)sulfanyl]-3,4-dihydro...)
Show SMILES OC(=O)c1ccncc1NC[C@@H]1CCOc2cc(Sc3ccc(F)cc3)ccc12 |r|
Show InChI InChI=1S/C22H19FN2O3S/c23-15-1-3-16(4-2-15)29-17-5-6-18-14(8-10-28-21(18)11-17)12-25-20-13-24-9-7-19(20)22(26)27/h1-7,9,11,13-14,25H,8,10,12H2,(H,26,27)/t14-/m0/s1
US Patent
n/an/a 550n/an/an/an/an/a25
Celgene Quanticel Research, Inc.
US Patent
Assay Description
The ability of test compounds to inhibit the activity of JMJD2C was determined in 384-well plate format under the following reaction conditions: 0.3 ...
US Patent US10106534 (2018)
BindingDB Entry DOI: 10.7270/Q2JW8GZX