null
SMILES: COCCNC(=O)[C@@H]1CCCN1C(=O)[C@H](N)Cc1ccc(Cl)cc1
InChI Key: InChIKey=BGIFZFZXRLDKGM-CABCVRRESA-N
Activity Spreadsheet -- Enzyme Inhibition Constant Data from BindingDB
Found 1 hit for monomerid = 29374
Trg + Lig
Ki
nM
ΔG°
kcal/mole
IC50
nM
Kd
nM
EC50/IC50
nM
koff
s-1
kon
M-1s-1
pHTemp
°C
Prothrombin
(Homo sapiens (Human))
BDBM29374
(proline scaffold, 23)
Show SMILES COCCNC(=O)[C@@H]1CCCN1C(=O)[C@H](N)Cc1ccc(Cl)cc1 |r|
Show InChI InChI=1S/C17H24ClN3O3/c1-24-10-8-20-16(22)15-3-2-9-21(15)17(23)14(19)11-12-4-6-13(18)7-5-12/h4-7,14-15H,2-3,8-11,19H2,1H3,(H,20,22)/t14-,15+/m1/s1
n/an/a>4.00E+5 1.40E+5n/an/an/a7.437
University of Kalmar
Assay Description
SPR experiments where performed with a Biacore A100 using Series S sensor chip CM5 (GE Healthcare Bio-Sciences AB, Uppsala, Sweden). The proteins wer...
J Med Chem 52: 2708-15 (2009)
Article DOI: 10.1021/jm8011849
BindingDB Entry DOI: 10.7270/Q2H130B7