BDBM29376 proline scaffold, 25
SMILES: CNC(=O)[C@@H]1CCCN1C(=O)[C@H](N)C(c1ccccc1)c1ccccc1
InChI Key: InChIKey=AGUIOJHVXCEFBZ-PKOBYXMFSA-N
Data: 1 IC50  1 Kd
PDB links: 6 PDB IDs contain this monomer as substructures. 6 PDB IDs contain inhibitors having a similarity of 90% to this monomer.
Activity Spreadsheet -- Enzyme Inhibition Constant Data from BindingDB
Found 1 hit for monomerid = 29376
Trg + Lig
Ki
nM
ΔG°
kcal/mole
IC50
nM
Kd
nM
EC50/IC50
nM
koff
s-1
kon
M-1s-1
pHTemp
°C
Prothrombin
(Homo sapiens (Human))
BDBM29376
(proline scaffold, 25)
Show SMILES CNC(=O)[C@@H]1CCCN1C(=O)[C@H](N)C(c1ccccc1)c1ccccc1 |r|
Show InChI InChI=1S/C21H25N3O2/c1-23-20(25)17-13-8-14-24(17)21(26)19(22)18(15-9-4-2-5-10-15)16-11-6-3-7-12-16/h2-7,9-12,17-19H,8,13-14,22H2,1H3,(H,23,25)/t17-,19+/m0/s1
n/an/a 2.30E+5 3.80E+4n/an/an/a7.437
University of Kalmar
Assay Description
SPR experiments where performed with a Biacore A100 using Series S sensor chip CM5 (GE Healthcare Bio-Sciences AB, Uppsala, Sweden). The proteins wer...
J Med Chem 52: 2708-15 (2009)
Article DOI: 10.1021/jm8011849
BindingDB Entry DOI: 10.7270/Q2H130B7