BDBM29377 proline scaffold, 26
SMILES: CCCNC(=O)[C@@H]1CCCN1C(=O)[C@H](N)C(c1ccccc1)c1ccccc1
InChI Key: InChIKey=HZKKJPDVZGOOPU-PZJWPPBQSA-N
Data: 1 IC50  1 Kd
PDB links: 1 PDB ID matches this monomer. 2 PDB IDs contain this monomer as substructures. 2 PDB IDs contain inhibitors having a similarity of 90% to this monomer.
Activity Spreadsheet -- Enzyme Inhibition Constant Data from BindingDB
Found 1 hit for monomerid = 29377
Trg + Lig
Ki
nM
ΔG°
kcal/mole
IC50
nM
Kd
nM
EC50/IC50
nM
koff
s-1
kon
M-1s-1
pHTemp
°C
Prothrombin
(Homo sapiens (Human))
BDBM29377
(proline scaffold, 26)
Show SMILES CCCNC(=O)[C@@H]1CCCN1C(=O)[C@H](N)C(c1ccccc1)c1ccccc1 |r|
Show InChI InChI=1S/C23H29N3O2/c1-2-15-25-22(27)19-14-9-16-26(19)23(28)21(24)20(17-10-5-3-6-11-17)18-12-7-4-8-13-18/h3-8,10-13,19-21H,2,9,14-16,24H2,1H3,(H,25,27)/t19-,21+/m0/s1
n/an/a 1.80E+4 3.10E+3n/an/an/an/an/a
University of Kalmar
Assay Description
SPR experiments where performed with a Biacore A100 using Series S sensor chip CM5 (GE Healthcare Bio-Sciences AB, Uppsala, Sweden). The proteins wer...
J Med Chem 52: 2708-15 (2009)
Article DOI: 10.1021/jm8011849
BindingDB Entry DOI: 10.7270/Q2H130B7
3D
3D Structure (crystal)