BDBM29384 proline scaffold, 33
SMILES: CC(C)CNC(=O)[C@@H]1CCCN1C(=O)[C@H](N)C1CCCCC1
InChI Key: InChIKey=ZYCVLCRDPVVDBP-LSDHHAIUSA-N
Data: 1 IC50  1 Kd
Activity Spreadsheet -- Enzyme Inhibition Constant Data from BindingDB
Found 1 hit for monomerid = 29384
Trg + Lig
Ki
nM
ΔG°
kcal/mole
IC50
nM
Kd
nM
EC50/IC50
nM
koff
s-1
kon
M-1s-1
pHTemp
°C
Prothrombin
(Homo sapiens (Human))
BDBM29384
(proline scaffold, 33)
Show SMILES CC(C)CNC(=O)[C@@H]1CCCN1C(=O)[C@H](N)C1CCCCC1 |r|
Show InChI InChI=1S/C17H31N3O2/c1-12(2)11-19-16(21)14-9-6-10-20(14)17(22)15(18)13-7-4-3-5-8-13/h12-15H,3-11,18H2,1-2H3,(H,19,21)/t14-,15+/m0/s1
n/an/a 2.30E+5 4.90E+4n/an/an/an/an/a
University of Kalmar
Assay Description
SPR experiments where performed with a Biacore A100 using Series S sensor chip CM5 (GE Healthcare Bio-Sciences AB, Uppsala, Sweden). The proteins wer...
J Med Chem 52: 2708-15 (2009)
Article DOI: 10.1021/jm8011849
BindingDB Entry DOI: 10.7270/Q2H130B7