BDBM29421 7-alkoxyisoquinoline, 31
SMILES: C(Oc1cc2cnccc2cc1-c1ccccc1)C1CCCNC1
InChI Key: InChIKey=IGEXQLRNXKQBQI-UHFFFAOYSA-N
Data: 2 IC50
Activity Spreadsheet -- Enzyme Inhibition Constant Data from BindingDB
Found 2 hits for monomerid = 29421
Trg + Lig
Ki
nM
ΔG°
kcal/mole
IC50
nM
Kd
nM
EC50/IC50
nM
koff
s-1
kon
M-1s-1
pHTemp
°C
Inhibitor of nuclear factor kappa-B kinase subunit beta
(Homo sapiens (Human))
BDBM29421
(7-alkoxyisoquinoline, 31)
Show SMILES C(Oc1cc2cnccc2cc1-c1ccccc1)C1CCCNC1
Show InChI InChI=1S/C21H22N2O/c1-2-6-17(7-3-1)20-11-18-8-10-23-14-19(18)12-21(20)24-15-16-5-4-9-22-13-16/h1-3,6-8,10-12,14,16,22H,4-5,9,13,15H2
NCI pathway
Reactome pathway
n/an/a 158n/an/an/an/an/an/a
GSK
Assay Description
IKK kinase activity was assessed using a time-resolved fluorescence resonance energy transfer (TR-FRET) assay. The reaction was initiated by the addi...
J Med Chem 52: 3098-102 (2009)
Article DOI: 10.1021/jm9000117
BindingDB Entry DOI: 10.7270/Q27H1GX7
Inhibitor of nuclear factor kappa-B kinase subunit alpha
(Homo sapiens (Human))
BDBM29421
(7-alkoxyisoquinoline, 31)
Show SMILES C(Oc1cc2cnccc2cc1-c1ccccc1)C1CCCNC1
Show InChI InChI=1S/C21H22N2O/c1-2-6-17(7-3-1)20-11-18-8-10-23-14-19(18)12-21(20)24-15-16-5-4-9-22-13-16/h1-3,6-8,10-12,14,16,22H,4-5,9,13,15H2
Reactome pathway
n/an/a 3.16E+3n/an/an/an/a7.422
GSK
Assay Description
IKK kinase activity was assessed using a time-resolved fluorescence resonance energy transfer (TR-FRET) assay. The reaction was initiated by the addi...
J Med Chem 52: 3098-102 (2009)
Article DOI: 10.1021/jm9000117
BindingDB Entry DOI: 10.7270/Q27H1GX7