BDBM294225 (±)-3-(1-(dimethylamino)ethyl)-6-oxo-6H-benzo[c]chromen-1-yl ethyl(methyl)carbamate::US9586925, Compound FAR-01-2CA::US9586925, EXAMPLE XIX
SMILES: CCN(C)C(=O)Oc1cc(cc2oc(=O)c3ccccc3c12)C(C)N(C)C
InChI Key: InChIKey=YGXKBTHHWMVNNV-UHFFFAOYSA-N
Data: 2 IC50
Activity Spreadsheet -- Enzyme Inhibition Constant Data from BindingDB
Found 2 hits for monomerid = 294225
Trg + Lig
Ki
nM
ΔG°
kcal/mole
IC50
nM
Kd
nM
EC50/IC50
nM
koff
s-1
kon
M-1s-1
pHTemp
°C
Cholinesterases
(Homo sapiens (Human))
BDBM294225
((±)-3-(1-(dimethylamino)ethyl)-6-oxo-6H-benzo[c]ch...)
Show SMILES CCN(C)C(=O)Oc1cc(cc2oc(=O)c3ccccc3c12)C(C)N(C)C
Show InChI InChI=1S/C21H24N2O4/c1-6-23(5)21(25)27-18-12-14(13(2)22(3)4)11-17-19(18)15-9-7-8-10-16(15)20(24)26-17/h7-13H,6H2,1-5H3
Reactome pathway
US Patent
n/an/a 1.27E+4n/an/an/an/an/an/a
NOBEL ILAÇ SANAYII VE TICARET A.S.
US Patent
Assay Description
The potential of the compounds of the present invention to inhibit acetylcholinesterase and butyrylcholinesterase enzymes were tested according to th...
US Patent US9586925 (2017)
BindingDB Entry DOI: 10.7270/Q24Q7X1C
Acetylcholinesterase
(Homo sapiens (Human))
BDBM294225
((±)-3-(1-(dimethylamino)ethyl)-6-oxo-6H-benzo[c]ch...)
Show SMILES CCN(C)C(=O)Oc1cc(cc2oc(=O)c3ccccc3c12)C(C)N(C)C
Show InChI InChI=1S/C21H24N2O4/c1-6-23(5)21(25)27-18-12-14(13(2)22(3)4)11-17-19(18)15-9-7-8-10-16(15)20(24)26-17/h7-13H,6H2,1-5H3
NCI pathway
Reactome pathway
US Patent
n/an/a 4.00E+4n/an/an/an/an/an/a
NOBEL ILAÇ SANAYII VE TICARET A.S.
US Patent
Assay Description
The potential of the compounds of the present invention to inhibit acetylcholinesterase and butyrylcholinesterase enzymes were tested according to th...
US Patent US9586925 (2017)
BindingDB Entry DOI: 10.7270/Q24Q7X1C