null
SMILES: COc1ccc(-c2c(C)nn3c(nc(C)nc23)N(CCC#N)C2CC2)c(C)c1
InChI Key: InChIKey=TYRWITFDDYPZEI-UHFFFAOYSA-N
Activity Spreadsheet -- Enzyme Inhibition Constant Data from BindingDB
Found 1 hit for monomerid = 29440
Trg + Lig
Ki
nM
ΔG°
kcal/mole
IC50
nM
Kd
nM
EC50/IC50
nM
koff
s-1
kon
M-1s-1
pHTemp
°C
Corticotropin-releasing factor receptor 1
(Rattus norvegicus (rat))
BDBM29440
(Pyrazolo[1,5-a]-1,3,5-triazine, 12-9)
Show SMILES COc1ccc(-c2c(C)nn3c(nc(C)nc23)N(CCC#N)C2CC2)c(C)c1 |(1.01,-4.1,;-.33,-3.33,;-.33,-1.79,;-1.66,-1.02,;-1.66,.52,;-.33,1.29,;-.31,2.83,;.95,3.72,;2.41,3.23,;.49,5.19,;-1.05,5.21,;-2.07,6.37,;-3.58,6.06,;-4.07,4.61,;-5.58,4.3,;-3.05,3.45,;-1.54,3.75,;-1.57,7.83,;-.06,8.13,;.43,9.59,;1.94,9.89,;3.43,10.29,;-2.59,8.98,;-3.36,10.32,;-4.13,8.98,;1.01,.52,;2.34,1.29,;1.01,-1.02,)|
Show InChI InChI=1S/C21H24N6O/c1-13-12-17(28-4)8-9-18(13)19-14(2)25-27-20(19)23-15(3)24-21(27)26(11-5-10-22)16-6-7-16/h8-9,12,16H,5-7,11H2,1-4H3
Reactome pathway
n/an/a 1.88n/an/an/an/a7.223
Bristol-Myers Squibb Company
Assay Description
Naive rats were sacrificed by decapitation, and the brain and pituitary were collected. Slide-mounted brain sections were preincubated in an assay so...
J Med Chem 52: 3073-83 (2009)
Article DOI: 10.1021/jm9000242
BindingDB Entry DOI: 10.7270/Q23R0R6X