null
SMILES: CNC1CN(C1)c1nc2ncc(Br)cc2n2nnnc12
InChI Key: InChIKey=ICGICUHMULRYIQ-UHFFFAOYSA-N
Activity Spreadsheet -- Enzyme Inhibition Constant Data from BindingDB
Found 10 hits for monomerid = 294407
Trg + Lig
Ki
nM
ΔG°
kcal/mole
IC50
nM
Kd
nM
EC50/IC50
nM
koff
s-1
kon
M-1s-1
pHTemp
°C
Histamine H4 receptor
(Homo sapiens (Human))
BDBM294407
(US9586959, Compound 69 | US9586959, Compound 95)
Show SMILES CNC1CN(C1)c1nc2ncc(Br)cc2n2nnnc12
Show InChI InChI=1S/C11H11BrN8/c1-13-7-4-19(5-7)10-11-16-17-18-20(11)8-2-6(12)3-14-9(8)15-10/h2-3,7,13H,4-5H2,1H3
Reactome pathway
US Patent
n/an/a 35n/an/an/an/a7.525
C&C RESEARCH LABORATORIES
US Patent
Assay Description
In vitro profiling protein kinases was performed using the HotSpot assay platform. Briefly, specific kinase/substrate pairs along with required cofac...
US Patent US9586959 (2017)
BindingDB Entry DOI: 10.7270/Q2C53NWD
Histamine H4 receptor
(Homo sapiens (Human))
BDBM294407
(US9586959, Compound 69 | US9586959, Compound 95)
Show SMILES CNC1CN(C1)c1nc2ncc(Br)cc2n2nnnc12
Show InChI InChI=1S/C11H11BrN8/c1-13-7-4-19(5-7)10-11-16-17-18-20(11)8-2-6(12)3-14-9(8)15-10/h2-3,7,13H,4-5H2,1H3
Reactome pathway
US Patent
n/an/a 44n/an/an/an/a7.525
C&C RESEARCH LABORATORIES
US Patent
Assay Description
In vitro profiling protein kinases was performed using the HotSpot assay platform. Briefly, specific kinase/substrate pairs along with required cofac...
US Patent US9586959 (2017)
BindingDB Entry DOI: 10.7270/Q2C53NWD
Histamine H3 receptor
(Homo sapiens (Human))
BDBM294407
(US9586959, Compound 69 | US9586959, Compound 95)
Show SMILES CNC1CN(C1)c1nc2ncc(Br)cc2n2nnnc12
Show InChI InChI=1S/C11H11BrN8/c1-13-7-4-19(5-7)10-11-16-17-18-20(11)8-2-6(12)3-14-9(8)15-10/h2-3,7,13H,4-5H2,1H3
Reactome pathway
US Patent
n/an/a>1.00E+8n/an/an/an/a7.427
C&C RESEARCH LABORATORIES
US Patent
Assay Description
Each compound of the present invention prepared in the examples was prepared in DMSO into concentrations of 0.02, 0.06, 0.3 and 2 mM. 10 uL of the pr...
US Patent US9586959 (2017)
BindingDB Entry DOI: 10.7270/Q2C53NWD
Histamine H3 receptor
(Homo sapiens (Human))
BDBM294407
(US9586959, Compound 69 | US9586959, Compound 95)
Show SMILES CNC1CN(C1)c1nc2ncc(Br)cc2n2nnnc12
Show InChI InChI=1S/C11H11BrN8/c1-13-7-4-19(5-7)10-11-16-17-18-20(11)8-2-6(12)3-14-9(8)15-10/h2-3,7,13H,4-5H2,1H3
Reactome pathway
US Patent
n/an/a>1.00E+8n/an/an/an/a7.427
C&C RESEARCH LABORATORIES
US Patent
Assay Description
Each compound of the present invention prepared in the examples was prepared in DMSO into concentrations of 0.02, 0.06, 0.3 and 2 mM. 10 uL of the pr...
US Patent US9586959 (2017)
BindingDB Entry DOI: 10.7270/Q2C53NWD
Histamine H4 receptor
(Mus musculus (mouse))
BDBM294407
(US9586959, Compound 69 | US9586959, Compound 95)
Show SMILES CNC1CN(C1)c1nc2ncc(Br)cc2n2nnnc12
Show InChI InChI=1S/C11H11BrN8/c1-13-7-4-19(5-7)10-11-16-17-18-20(11)8-2-6(12)3-14-9(8)15-10/h2-3,7,13H,4-5H2,1H3
Reactome pathway
n/an/a 690n/an/an/an/an/an/a
TBA
Citation and Details
Histamine H4 receptor
(Homo sapiens (Human))
BDBM294407
(US9586959, Compound 69 | US9586959, Compound 95)
Show SMILES CNC1CN(C1)c1nc2ncc(Br)cc2n2nnnc12
Show InChI InChI=1S/C11H11BrN8/c1-13-7-4-19(5-7)10-11-16-17-18-20(11)8-2-6(12)3-14-9(8)15-10/h2-3,7,13H,4-5H2,1H3
Reactome pathway
n/an/a 27n/an/an/an/an/an/a
TBA
Citation and Details
Histamine H3 receptor
(Homo sapiens (Human))
BDBM294407
(US9586959, Compound 69 | US9586959, Compound 95)
Show SMILES CNC1CN(C1)c1nc2ncc(Br)cc2n2nnnc12
Show InChI InChI=1S/C11H11BrN8/c1-13-7-4-19(5-7)10-11-16-17-18-20(11)8-2-6(12)3-14-9(8)15-10/h2-3,7,13H,4-5H2,1H3
Reactome pathway
n/an/a>1.00E+5n/an/an/an/an/an/a
TBA
Citation and Details
Histamine H4 receptor
(Mus musculus (mouse))
BDBM294407
(US9586959, Compound 69 | US9586959, Compound 95)
Show SMILES CNC1CN(C1)c1nc2ncc(Br)cc2n2nnnc12
Show InChI InChI=1S/C11H11BrN8/c1-13-7-4-19(5-7)10-11-16-17-18-20(11)8-2-6(12)3-14-9(8)15-10/h2-3,7,13H,4-5H2,1H3
Reactome pathway
n/an/a 290n/an/an/an/an/an/a
TBA
Citation and Details
Histamine H4 receptor
(Homo sapiens (Human))
BDBM294407
(US9586959, Compound 69 | US9586959, Compound 95)
Show SMILES CNC1CN(C1)c1nc2ncc(Br)cc2n2nnnc12
Show InChI InChI=1S/C11H11BrN8/c1-13-7-4-19(5-7)10-11-16-17-18-20(11)8-2-6(12)3-14-9(8)15-10/h2-3,7,13H,4-5H2,1H3
Reactome pathway
n/an/a 28n/an/an/an/an/an/a
TBA
Citation and Details
5-hydroxytryptamine receptor 3A
(Homo sapiens (Human))
BDBM294407
(US9586959, Compound 69 | US9586959, Compound 95)
Show SMILES CNC1CN(C1)c1nc2ncc(Br)cc2n2nnnc12
Show InChI InChI=1S/C11H11BrN8/c1-13-7-4-19(5-7)10-11-16-17-18-20(11)8-2-6(12)3-14-9(8)15-10/h2-3,7,13H,4-5H2,1H3
Reactome pathway
US Patent
n/an/a>1.00E+7n/an/an/an/an/an/a
C&C RESEARCH LABORATORIES
US Patent
Assay Description
The binding assays of the human serotonin 3 receptor for present invention were performed at Cerep (Poitiers, France).
US Patent US9586959 (2017)
BindingDB Entry DOI: 10.7270/Q2C53NWD