BDBM294408 US9586959, Compound 74
SMILES: Brc1cnc2nc(N3CCN4CCCC4C3)c3nncn3c2c1
InChI Key: InChIKey=JEWSSXKQNAONAY-UHFFFAOYSA-N
Data: 1 IC50
Activity Spreadsheet -- Enzyme Inhibition Constant Data from BindingDB
Found 1 hit for monomerid = 294408
Trg + Lig
Ki
nM
ΔG°
kcal/mole
IC50
nM
Kd
nM
EC50/IC50
nM
koff
s-1
kon
M-1s-1
pHTemp
°C
Histamine H4 receptor
(Homo sapiens (Human))
BDBM294408
(US9586959, Compound 74)
Show SMILES Brc1cnc2nc(N3CCN4CCCC4C3)c3nncn3c2c1
Show InChI InChI=1S/C15H16BrN7/c16-10-6-12-13(17-7-10)19-14(15-20-18-9-23(12)15)22-5-4-21-3-1-2-11(21)8-22/h6-7,9,11H,1-5,8H2
Reactome pathway
US Patent
n/an/a 60n/an/an/an/a7.525
C&C RESEARCH LABORATORIES
US Patent
Assay Description
In vitro profiling protein kinases was performed using the HotSpot assay platform. Briefly, specific kinase/substrate pairs along with required cofac...
US Patent US9586959 (2017)
BindingDB Entry DOI: 10.7270/Q2C53NWD