null
SMILES: COCCN(CC1CC1)c1nc(C)nc2c(c(C)nn12)-c1c(C)cc(OC)cc1OC
InChI Key: InChIKey=SFAPIRSVXCYDJJ-UHFFFAOYSA-N
Activity Spreadsheet -- Enzyme Inhibition Constant Data from BindingDB
Found 1 hit for monomerid = 29458
Trg + Lig
Ki
nM
ΔG°
kcal/mole
IC50
nM
Kd
nM
EC50/IC50
nM
koff
s-1
kon
M-1s-1
pHTemp
°C
Corticotropin-releasing factor receptor 1
(Rattus norvegicus (rat))
BDBM29458
(Pyrazolo[1,5-a]-1,3,5-triazine, 12-27)
Show SMILES COCCN(CC1CC1)c1nc(C)nc2c(c(C)nn12)-c1c(C)cc(OC)cc1OC |(2.43,11.35,;1.94,9.89,;.43,9.59,;-.06,8.13,;-1.57,7.83,;-2.59,8.98,;-4.1,8.68,;-5.55,9.2,;-5.28,7.69,;-2.07,6.37,;-3.58,6.06,;-4.07,4.61,;-5.58,4.3,;-3.05,3.45,;-1.54,3.75,;-.31,2.83,;.95,3.72,;2.41,3.23,;.49,5.19,;-1.05,5.21,;-.33,1.29,;1.01,.52,;2.34,1.29,;1.01,-1.02,;-.33,-1.79,;-.33,-3.33,;1.01,-4.1,;-1.66,-1.02,;-1.66,.52,;-2.99,1.29,;-4.33,.52,)|
Show InChI InChI=1S/C23H31N5O3/c1-14-11-18(30-5)12-19(31-6)20(14)21-15(2)26-28-22(21)24-16(3)25-23(28)27(9-10-29-4)13-17-7-8-17/h11-12,17H,7-10,13H2,1-6H3
Reactome pathway
n/an/a 1.80n/an/an/an/a7.223
Bristol-Myers Squibb Company
Assay Description
Naive rats were sacrificed by decapitation, and the brain and pituitary were collected. Slide-mounted brain sections were preincubated in an assay so...
J Med Chem 52: 3073-83 (2009)
Article DOI: 10.1021/jm9000242
BindingDB Entry DOI: 10.7270/Q23R0R6X