BDBM294622 (S)-2-(tert-butoxy)-2-((R)-2-(3,3-difluoropiperidine-1-carbonyl)-6-(8-fluoro-5-methylchroman-6-yl)-4,7-dimethylisoindolin-5-yl)acetic acid::US10112899, Example 102
SMILES: Cc1c2CN(Cc2c(C)c(-c2cc(F)c3OCCCc3c2C)c1[C@H](OC(C)(C)C)C(O)=O)C(=O)N1CCCC(F)(F)C1
InChI Key: InChIKey=FPMTWALRSRBEDB-NDEPHWFRSA-N
Data: 1 IC50
Activity Spreadsheet -- Enzyme Inhibition Constant Data from BindingDB
Found 1 hit for monomerid = 294622
Trg + Lig
Ki
nM
ΔG°
kcal/mole
IC50
nM
Kd
nM
EC50/IC50
nM
koff
s-1
kon
M-1s-1
pHTemp
°C
Human immunodeficiency virus type 1 integrase
(Human immunodeficiency virus 1)
BDBM294622
((S)-2-(tert-butoxy)-2-((R)-2-(3,3-difluoropiperidi...)
Show SMILES Cc1c2CN(Cc2c(C)c(-c2cc(F)c3OCCCc3c2C)c1[C@H](OC(C)(C)C)C(O)=O)C(=O)N1CCCC(F)(F)C1 |r,wD:23.27,(3.9,-2.84,;2.57,-2.07,;1.24,-2.84,;.92,-4.34,;-.62,-4.51,;-1.24,-3.1,;-.1,-2.07,;-.1,-.53,;-1.43,.24,;1.24,.24,;1.24,1.78,;2.57,2.55,;2.57,4.09,;3.9,4.86,;1.24,4.86,;1.24,6.4,;-.1,7.17,;-1.43,6.4,;-1.43,4.86,;-.1,4.09,;-.1,2.55,;-1.43,1.78,;2.57,-.53,;3.9,.24,;3.9,1.78,;5.24,2.55,;6.57,1.78,;5.24,4.09,;6.57,3.32,;5.24,-.53,;6.57,.24,;5.24,-2.07,;-1.39,-5.84,;-.62,-7.17,;-2.93,-5.84,;-3.7,-7.17,;-5.24,-7.17,;-6.01,-5.84,;-5.24,-4.51,;-5.24,-2.97,;-6.57,-3.74,;-3.7,-4.51,)|
Show InChI InChI=1S/C32H39F3N2O5/c1-17-20-9-7-12-41-27(20)24(33)13-21(17)25-18(2)22-14-37(30(40)36-11-8-10-32(34,35)16-36)15-23(22)19(3)26(25)28(29(38)39)42-31(4,5)6/h13,28H,7-12,14-16H2,1-6H3,(H,38,39)/t28-/m0/s1
US Patent
n/an/a 2n/an/an/an/an/an/a
ViiV HEALTHCARE UK LIMITED
US Patent
Assay Description
Antiviral HIV activity and cytotoxicity values for compounds of the invention from Table 1 were measured in parallel in the HTLV-1 transformed cell l...
US Patent US10112899 (2018)
BindingDB Entry DOI: 10.7270/Q2KP8465