null
SMILES: CCC(CC)Nc1nc(C)nc2c(c(C)nn12)-c1cc(OC)c(OC)cc1Br
InChI Key: InChIKey=NZWMZVHZCVKNTF-UHFFFAOYSA-N
Activity Spreadsheet -- Enzyme Inhibition Constant Data from BindingDB
Found 1 hit for monomerid = 29470
Trg + Lig
Ki
nM
ΔG°
kcal/mole
IC50
nM
Kd
nM
EC50/IC50
nM
koff
s-1
kon
M-1s-1
pHTemp
°C
Corticotropin-releasing factor receptor 1
(Rattus norvegicus (rat))
BDBM29470
(Pyrazolo[1,5-a]-1,3,5-triazine, 12-39)
Show SMILES CCC(CC)Nc1nc(C)nc2c(c(C)nn12)-c1cc(OC)c(OC)cc1Br |(1.85,10.04,;.35,9.67,;-.08,8.19,;.99,7.08,;2.48,7.47,;-1.57,7.83,;-2.07,6.37,;-3.58,6.06,;-4.07,4.61,;-5.58,4.3,;-3.05,3.45,;-1.54,3.75,;-.31,2.83,;.95,3.72,;2.41,3.23,;.49,5.19,;-1.05,5.21,;-.33,1.29,;-1.66,.52,;-1.66,-1.02,;-2.99,-1.79,;-2.99,-3.33,;-.33,-1.79,;-.33,-3.33,;1.01,-4.1,;1.01,-1.02,;1.01,.52,;2.34,1.29,)|
Show InChI InChI=1S/C20H26BrN5O2/c1-7-13(8-2)24-20-23-12(4)22-19-18(11(3)25-26(19)20)14-9-16(27-5)17(28-6)10-15(14)21/h9-10,13H,7-8H2,1-6H3,(H,22,23,24)
Reactome pathway
n/an/a 6.08n/an/an/an/an/a25
Bristol-Myers Squibb Company
Assay Description
Naive rats were sacrificed by decapitation, and the brain and pituitary were collected. Slide-mounted brain sections were preincubated in an assay so...
J Med Chem 52: 3073-83 (2009)
Article DOI: 10.1021/jm9000242
BindingDB Entry DOI: 10.7270/Q23R0R6X