BDBM294706 US10112899, Example 184
SMILES: Cc1c2CN(Cc2c(C)c(-c2cc(F)c3OCCCc3c2C)c1[C@H](OC(C)(C)C)C(O)=O)C(=O)c1ccccn1
InChI Key: InChIKey=SOALSGPLNPAPSV-LJAQVGFWSA-N
Data: 1 IC50
Activity Spreadsheet -- Enzyme Inhibition Constant Data from BindingDB
Found 1 hit for monomerid = 294706
Trg + Lig
Ki
nM
ΔG°
kcal/mole
IC50
nM
Kd
nM
EC50/IC50
nM
koff
s-1
kon
M-1s-1
pHTemp
°C
Human immunodeficiency virus type 1 integrase
(Human immunodeficiency virus 1)
BDBM294706
(US10112899, Example 184)
Show SMILES Cc1c2CN(Cc2c(C)c(-c2cc(F)c3OCCCc3c2C)c1[C@H](OC(C)(C)C)C(O)=O)C(=O)c1ccccn1 |r,wD:23.27,(3.62,-2.84,;2.29,-2.07,;.95,-2.84,;.63,-4.34,;-.9,-4.51,;-1.52,-3.1,;-.38,-2.07,;-.38,-.53,;-1.71,.24,;.95,.24,;.95,1.78,;2.29,2.55,;2.29,4.09,;3.62,4.86,;.95,4.86,;.95,6.4,;-.38,7.17,;-1.71,6.4,;-1.71,4.86,;-.38,4.09,;-.38,2.55,;-1.71,1.78,;2.29,-.53,;3.62,.24,;3.62,1.78,;4.95,2.55,;4.95,4.09,;6.29,1.78,;6.29,3.32,;4.95,-.53,;6.29,.24,;4.95,-2.07,;-1.67,-5.84,;-.9,-7.17,;-3.21,-5.84,;-3.98,-4.51,;-5.52,-4.51,;-6.29,-5.84,;-5.52,-7.17,;-3.98,-7.17,)|
Show InChI InChI=1S/C32H35FN2O5/c1-17-20-10-9-13-39-28(20)24(33)14-21(17)26-18(2)22-15-35(30(36)25-11-7-8-12-34-25)16-23(22)19(3)27(26)29(31(37)38)40-32(4,5)6/h7-8,11-12,14,29H,9-10,13,15-16H2,1-6H3,(H,37,38)/t29-/m0/s1
US Patent
n/an/a 2n/an/an/an/an/an/a
ViiV HEALTHCARE UK LIMITED
US Patent
Assay Description
Antiviral HIV activity and cytotoxicity values for compounds of the invention from Table 1 were measured in parallel in the HTLV-1 transformed cell l...
US Patent US10112899 (2018)
BindingDB Entry DOI: 10.7270/Q2KP8465