BDBM294915 US10112907, Example 00026
SMILES: NC(=O)c1cn(nc1Nc1ccc(cc1)C(F)(F)F)[C@@H]1CC[C@H](C[C@H]1[N+]#[C-])N1CCC1
InChI Key: InChIKey=YOHZCNFQWQKCFW-KBAYOESNSA-N
Data: 4 IC50
Activity Spreadsheet -- Enzyme Inhibition Constant Data from BindingDB
Found 4 hits for monomerid = 294915
Trg + Lig
Ki
nM
ΔG°
kcal/mole
IC50
nM
Kd
nM
EC50/IC50
nM
koff
s-1
kon
M-1s-1
pHTemp
°C
JAK1 (aa 866-1154)
(Homo sapiens (Human))
BDBM294915
(US10112907, Example 00026)
Show SMILES NC(=O)c1cn(nc1Nc1ccc(cc1)C(F)(F)F)[C@@H]1CC[C@H](C[C@H]1[N+]#[C-])N1CCC1 |r|
Show InChI InChI=1S/C21H23F3N6O/c1-26-17-11-15(29-9-2-10-29)7-8-18(17)30-12-16(19(25)31)20(28-30)27-14-5-3-13(4-6-14)21(22,23)24/h3-6,12,15,17-18H,2,7-11H2,(H2,25,31)(H,27,28)/t15-,17-,18-/m1/s1
US Patent
n/an/a 2n/an/an/an/a7.5n/a
NOVARTIS AG
US Patent
Assay Description
A kinase selectivity panel which measures substrate peptide phosphorylation was set-up for recombinant human Jak1 (aa 866-1154), Jak2 (aa808-1132), J...
US Patent US10112907 (2018)
BindingDB Entry DOI: 10.7270/Q2FX7CHW
TYK2 (aa 888-1187)
(Homo sapiens (Human))
BDBM294915
(US10112907, Example 00026)
Show SMILES NC(=O)c1cn(nc1Nc1ccc(cc1)C(F)(F)F)[C@@H]1CC[C@H](C[C@H]1[N+]#[C-])N1CCC1 |r|
Show InChI InChI=1S/C21H23F3N6O/c1-26-17-11-15(29-9-2-10-29)7-8-18(17)30-12-16(19(25)31)20(28-30)27-14-5-3-13(4-6-14)21(22,23)24/h3-6,12,15,17-18H,2,7-11H2,(H2,25,31)(H,27,28)/t15-,17-,18-/m1/s1
US Patent
n/an/a 120n/an/an/an/a7.5n/a
NOVARTIS AG
US Patent
Assay Description
A kinase selectivity panel which measures substrate peptide phosphorylation was set-up for recombinant human Jak1 (aa 866-1154), Jak2 (aa808-1132), J...
US Patent US10112907 (2018)
BindingDB Entry DOI: 10.7270/Q2FX7CHW
JAK3 (aa 811-1124)
(Homo sapiens (Human))
BDBM294915
(US10112907, Example 00026)
Show SMILES NC(=O)c1cn(nc1Nc1ccc(cc1)C(F)(F)F)[C@@H]1CC[C@H](C[C@H]1[N+]#[C-])N1CCC1 |r|
Show InChI InChI=1S/C21H23F3N6O/c1-26-17-11-15(29-9-2-10-29)7-8-18(17)30-12-16(19(25)31)20(28-30)27-14-5-3-13(4-6-14)21(22,23)24/h3-6,12,15,17-18H,2,7-11H2,(H2,25,31)(H,27,28)/t15-,17-,18-/m1/s1
US Patent
n/an/a 1.00E+4n/an/an/an/a7.5n/a
NOVARTIS AG
US Patent
Assay Description
A kinase selectivity panel which measures substrate peptide phosphorylation was set-up for recombinant human Jak1 (aa 866-1154), Jak2 (aa808-1132), J...
US Patent US10112907 (2018)
BindingDB Entry DOI: 10.7270/Q2FX7CHW
JAK2 (aa 808-1132)
(Homo sapiens (Human))
BDBM294915
(US10112907, Example 00026)
Show SMILES NC(=O)c1cn(nc1Nc1ccc(cc1)C(F)(F)F)[C@@H]1CC[C@H](C[C@H]1[N+]#[C-])N1CCC1 |r|
Show InChI InChI=1S/C21H23F3N6O/c1-26-17-11-15(29-9-2-10-29)7-8-18(17)30-12-16(19(25)31)20(28-30)27-14-5-3-13(4-6-14)21(22,23)24/h3-6,12,15,17-18H,2,7-11H2,(H2,25,31)(H,27,28)/t15-,17-,18-/m1/s1
US Patent
n/an/a 240n/an/an/an/a7.5n/a
NOVARTIS AG
US Patent
Assay Description
A kinase selectivity panel which measures substrate peptide phosphorylation was set-up for recombinant human Jak1 (aa 866-1154), Jak2 (aa808-1132), J...
US Patent US10112907 (2018)
BindingDB Entry DOI: 10.7270/Q2FX7CHW