BDBM29591 benzylidenehydrazine derivative, 8
SMILES: ONC(=O)CCCCCC(=O)NN=Cc1cccc(O)c1
InChI Key: InChIKey=QACYACAYHBCBED-UHFFFAOYSA-N
Data: 1 IC50
Activity Spreadsheet -- Enzyme Inhibition Constant Data from BindingDB
Found 1 hit for monomerid = 29591
Trg + Lig
Ki
nM
ΔG°
kcal/mole
IC50
nM
Kd
nM
EC50/IC50
nM
koff
s-1
kon
M-1s-1
pHTemp
°C
Histone deacetylase
(Plasmodium falciparum (isolate 3D7))
BDBM29591
(benzylidenehydrazine derivative, 8)
Show SMILES ONC(=O)CCCCCC(=O)NN=Cc1cccc(O)c1 |w:13.13|
Show InChI InChI=1S/C14H19N3O4/c18-12-6-4-5-11(9-12)10-15-16-13(19)7-2-1-3-8-14(20)17-21/h4-6,9-10,18,21H,1-3,7-8H2,(H,16,19)(H,17,20)
n/an/a 59n/an/an/an/a7.523
Harvard Medical School
Assay Description
Recombinant pfHDAC-1 was assayed with substrate in the presence of test compound. The substrate concentration was kept constant at 125 uM while the c...
J Med Chem 52: 2185-7 (2009)
Article DOI: 10.1021/jm801654y
BindingDB Entry DOI: 10.7270/Q26H4FRD