null
SMILES: ONC(=O)CCCCCC(=O)NN=Cc1cc2OCOc2cc1Br
InChI Key: InChIKey=DJQSNKHQDKDUDE-UHFFFAOYSA-N
Activity Spreadsheet -- Enzyme Inhibition Constant Data from BindingDB
Found 1 hit for monomerid = 29593
Trg + Lig
Ki
nM
ΔG°
kcal/mole
IC50
nM
Kd
nM
EC50/IC50
nM
koff
s-1
kon
M-1s-1
pHTemp
°C
Histone deacetylase
(Plasmodium falciparum (isolate 3D7))
BDBM29593
(benzylidenehydrazine derivative, 10)
Show SMILES ONC(=O)CCCCCC(=O)NN=Cc1cc2OCOc2cc1Br |w:13.13|
Show InChI InChI=1S/C15H18BrN3O5/c16-11-7-13-12(23-9-24-13)6-10(11)8-17-18-14(20)4-2-1-3-5-15(21)19-22/h6-8,22H,1-5,9H2,(H,18,20)(H,19,21)
n/an/a 20n/an/an/an/a7.523
Harvard Medical School
Assay Description
Recombinant pfHDAC-1 was assayed with substrate in the presence of test compound. The substrate concentration was kept constant at 125 uM while the c...
J Med Chem 52: 2185-7 (2009)
Article DOI: 10.1021/jm801654y
BindingDB Entry DOI: 10.7270/Q26H4FRD