BDBM29594 benzylidenehydrazine derivative, 11
SMILES: ONC(=O)CCCCCCC(=O)NN=Cc1c(O)cc(O)cc1O
InChI Key: InChIKey=KJYNQOYUWKHQSC-UHFFFAOYSA-N
Data: 1 IC50
Activity Spreadsheet -- Enzyme Inhibition Constant Data from BindingDB
Found 1 hit for monomerid = 29594
Trg + Lig
Ki
nM
ΔG°
kcal/mole
IC50
nM
Kd
nM
EC50/IC50
nM
koff
s-1
kon
M-1s-1
pHTemp
°C
Histone deacetylase
(Plasmodium falciparum (isolate 3D7))
BDBM29594
(benzylidenehydrazine derivative, 11)
Show SMILES ONC(=O)CCCCCCC(=O)NN=Cc1c(O)cc(O)cc1O |w:14.14|
Show InChI InChI=1S/C15H21N3O6/c19-10-7-12(20)11(13(21)8-10)9-16-17-14(22)5-3-1-2-4-6-15(23)18-24/h7-9,19-21,24H,1-6H2,(H,17,22)(H,18,23)
n/an/a 43n/an/an/an/a7.523
Harvard Medical School
Assay Description
Recombinant pfHDAC-1 was assayed with substrate in the presence of test compound. The substrate concentration was kept constant at 125 uM while the c...
J Med Chem 52: 2185-7 (2009)
Article DOI: 10.1021/jm801654y
BindingDB Entry DOI: 10.7270/Q26H4FRD