null
SMILES: ONC(=O)CCCCC(=O)NN=Cc1ccc(O)cc1Br
InChI Key: InChIKey=DDFBDWCZHISPDA-UHFFFAOYSA-N
Activity Spreadsheet -- Enzyme Inhibition Constant Data from BindingDB
Found 1 hit for monomerid = 29604
Trg + Lig
Ki
nM
ΔG°
kcal/mole
IC50
nM
Kd
nM
EC50/IC50
nM
koff
s-1
kon
M-1s-1
pHTemp
°C
Histone deacetylase
(Plasmodium falciparum (isolate 3D7))
BDBM29604
(benzylidenehydrazine derivative, 21)
Show SMILES ONC(=O)CCCCC(=O)NN=Cc1ccc(O)cc1Br |w:12.12|
Show InChI InChI=1S/C13H16BrN3O4/c14-11-7-10(18)6-5-9(11)8-15-16-12(19)3-1-2-4-13(20)17-21/h5-8,18,21H,1-4H2,(H,16,19)(H,17,20)
n/an/a 106n/an/an/an/a7.523
Harvard Medical School
Assay Description
Recombinant pfHDAC-1 was assayed with substrate in the presence of test compound. The substrate concentration was kept constant at 125 uM while the c...
J Med Chem 52: 2185-7 (2009)
Article DOI: 10.1021/jm801654y
BindingDB Entry DOI: 10.7270/Q26H4FRD