null
SMILES: ONC(=O)CCCCC(=O)NN=Cc1ccc(cc1)B(O)O
InChI Key: InChIKey=DJUIGODVOSDCOH-UHFFFAOYSA-N
Activity Spreadsheet -- Enzyme Inhibition Constant Data from BindingDB
Found 1 hit for monomerid = 29607
Trg + Lig
Ki
nM
ΔG°
kcal/mole
IC50
nM
Kd
nM
EC50/IC50
nM
koff
s-1
kon
M-1s-1
pHTemp
°C
Histone deacetylase
(Plasmodium falciparum (isolate 3D7))
BDBM29607
(benzylidenehydrazine derivative, 24)
Show SMILES ONC(=O)CCCCC(=O)NN=Cc1ccc(cc1)B(O)O |w:12.12|
Show InChI InChI=1S/C13H18BN3O5/c18-12(3-1-2-4-13(19)17-22)16-15-9-10-5-7-11(8-6-10)14(20)21/h5-9,20-22H,1-4H2,(H,16,18)(H,17,19)
n/an/a 45n/an/an/an/a7.523
Harvard Medical School
Assay Description
Recombinant pfHDAC-1 was assayed with substrate in the presence of test compound. The substrate concentration was kept constant at 125 uM while the c...
J Med Chem 52: 2185-7 (2009)
Article DOI: 10.1021/jm801654y
BindingDB Entry DOI: 10.7270/Q26H4FRD