BDBM29638 1-[4-(2-furoyl)piperazino]-3-isopropyl-pyrido[1,2-a]benzimidazole-4-carbonitrile::1-[4-(furan-2-carbonyl)piperazin-1-yl]-3-propan-2-ylpyrido[1,2-a]benzimidazole-4-carbonitrile::1-[4-(furan-2-ylcarbonyl)piperazin-1-yl]-3-propan-2-yl-pyrido[1,2-a]benzimidazole-4-carbonitrile::1-[4-[2-furanyl(oxo)methyl]-1-piperazinyl]-3-propan-2-yl-4-pyrido[1,2-a]benzimidazolecarbonitrile::MLS000103510::SMR000018805::cid_1284208
SMILES: CC(C)c1cc(N2CCN(CC2)C(=O)c2ccco2)n2c3ccccc3nc2c1C#N
InChI Key: InChIKey=SIVCAUIKASCNMM-UHFFFAOYSA-N
Data: 2 IC50  1 EC50
Activity Spreadsheet -- Enzyme Inhibition Constant Data from BindingDB
Found 3 hits for monomerid = 29638
Trg + Lig
Ki
nM
ΔG°
kcal/mole
IC50
nM
Kd
nM
EC50/IC50
nM
koff
s-1
kon
M-1s-1
pHTemp
°C
Runt-Related Transcription Factor 1 Isoform AML1C
(Homo sapiens (Human))
BDBM29638
(1-[4-(2-furoyl)piperazino]-3-isopropyl-pyrido[1,2-...)
Show SMILES CC(C)c1cc(N2CCN(CC2)C(=O)c2ccco2)n2c3ccccc3nc2c1C#N
Show InChI InChI=1S/C24H23N5O2/c1-16(2)17-14-22(27-9-11-28(12-10-27)24(30)21-8-5-13-31-21)29-20-7-4-3-6-19(20)26-23(29)18(17)15-25/h3-8,13-14,16H,9-12H2,1-2H3
NCI pathway
PCBioAssay
n/an/a 1.00E+5n/an/an/an/a7.423
Burnham Center for Chemical Genomics
Curated by PubChem BioAssay
Assay Description
This assay is to use HTS to identify inhibitors of the protein-protein interaction between the RUNX1 Runt domain and CBFbeta-SMMHC, a potential thera...
PubChem Bioassay (2009)
BindingDB Entry DOI: 10.7270/Q2DV1H7P
karyopherin alpha 2 (RAG cohort 1, importin alpha 1), isoform CRA_b
(Homo sapiens (Human))
BDBM29638
(1-[4-(2-furoyl)piperazino]-3-isopropyl-pyrido[1,2-...)
Show SMILES CC(C)c1cc(N2CCN(CC2)C(=O)c2ccco2)n2c3ccccc3nc2c1C#N
Show InChI InChI=1S/C24H23N5O2/c1-16(2)17-14-22(27-9-11-28(12-10-27)24(30)21-8-5-13-31-21)29-20-7-4-3-6-19(20)26-23(29)18(17)15-25/h3-8,13-14,16H,9-12H2,1-2H3
Reactome pathway
PCBioAssay
n/an/an/an/a 1.61E+4n/an/an/an/a
Broad Institute
Curated by PubChem BioAssay
Assay Description
Keywords: Counterscreen, FRET assay, HTS, YIC probe, Dose response, Assay Overview: This is a fluorescence resonance energy transfer (FRET)-based b...
PubChem Bioassay (2010)
BindingDB Entry DOI: 10.7270/Q280513R
Runt-Related Transcription Factor 1 Isoform AML1C
(Homo sapiens (Human))
BDBM29638
(1-[4-(2-furoyl)piperazino]-3-isopropyl-pyrido[1,2-...)
Show SMILES CC(C)c1cc(N2CCN(CC2)C(=O)c2ccco2)n2c3ccccc3nc2c1C#N
Show InChI InChI=1S/C24H23N5O2/c1-16(2)17-14-22(27-9-11-28(12-10-27)24(30)21-8-5-13-31-21)29-20-7-4-3-6-19(20)26-23(29)18(17)15-25/h3-8,13-14,16H,9-12H2,1-2H3
NCI pathway
PCBioAssay
n/an/a 1.00E+5n/an/an/an/a7.423
Burnham Center for Chemical Genomics
Curated by PubChem BioAssay
Assay Description
This assay is to identify inhibitors of the protein-protein interaction between the RUNX1 Runt domain and CBFbeta-SMMHC. This is accomplished by usin...
PubChem Bioassay (2009)
BindingDB Entry DOI: 10.7270/Q2T72FSX