BDBM297389 (2R,3R,4S,5R)-2-(6-amino-9H-purin-9-yl)-5-((((1r,3S)-3-(2-(5-(tert-butyl)-1H-benzo[d]imidazol-2-yl)ethyl)cyclobutyl)(isopropyl)amino)methyl)tetrahydrofuran-3,4-diol::US10112968, Compound A2
SMILES: CC(C)N(CC1OC([C@@H](O)C1O)n1cnc2c(N)ncnc12)C1CC(CCc2nc3ccc(cc3[nH]2)C(C)(C)C)C1
InChI Key:
Data: 1 IC50
Activity Spreadsheet -- Enzyme Inhibition Constant Data from BindingDB
Found 1 hit for monomerid = 297389
Trg + Lig
Ki
nM
ΔG°
kcal/mole
IC50
nM
Kd
nM
EC50/IC50
nM
koff
s-1
kon
M-1s-1
pHTemp
°C
Histone-lysine N-methyltransferase, H3 lysine-79 specific
(Homo sapiens (Human))
BDBM297389
((2R,3R,4S,5R)-2-(6-amino-9H-purin-9-yl)-5-((((1r,3...)
Show SMILES CC(C)N(CC1OC([C@@H](O)C1O)n1cnc2c(N)ncnc12)C1CC(CCc2nc3ccc(cc3[nH]2)C(C)(C)C)C1 |r,wD:8.8,(-11.05,-1.3,;-9.51,-1.3,;-8.74,.03,;-8.74,-2.64,;-9.51,-3.97,;-11.05,-3.97,;-11.96,-2.72,;-13.42,-3.2,;-13.42,-4.74,;-14.67,-5.65,;-11.96,-5.22,;-11.48,-6.68,;-14.67,-2.3,;-14.67,-.76,;-16.13,-.28,;-17.04,-1.53,;-18.57,-1.69,;-19.47,-.44,;-19.19,-3.09,;-18.29,-4.34,;-16.76,-4.18,;-16.13,-2.77,;-7.2,-2.64,;-6.11,-1.55,;-5.02,-2.64,;-3.48,-2.64,;-2.71,-1.3,;-1.17,-1.3,;-.27,-2.55,;1.2,-2.07,;2.53,-2.84,;3.86,-2.07,;3.86,-.53,;2.53,.24,;1.2,-.53,;-.27,-.06,;5.2,.24,;6.53,1.01,;5.97,-1.1,;4.43,1.57,;-6.11,-3.73,)|
US Patent
n/an/a 0.740n/an/an/an/an/an/a
Epizyme, Inc.
US Patent
Assay Description
Unless otherwise indicated, assays of DOT1L enzymatic activity were performed under balanced conditions (all substrates present at concentrations equ...
US Patent US10112968 (2018)
BindingDB Entry DOI: 10.7270/Q20R9RFJ