BDBM29768 hydroxyethylamine derivative, 22
SMILES: CCc1ccnc2c(cc(cc12)C(=O)N[C@@H](Cc1ccccc1)[C@H](O)CNCc1cccc(c1)C(F)(F)F)N1CCCC1=O
InChI Key: InChIKey=YDNCUOPJVVQEMT-MFMCTBQISA-N
Data: 3 IC50
PDB links: 1 PDB ID matches this monomer.
Activity Spreadsheet -- Enzyme Inhibition Constant Data from BindingDB
Found 3 hits for monomerid = 29768
Trg + Lig
Ki
nM
ΔG°
kcal/mole
IC50
nM
Kd
nM
EC50/IC50
nM
koff
s-1
kon
M-1s-1
pHTemp
°C
Beta-secretase 1
(Homo sapiens (Human))
BDBM29768
(hydroxyethylamine derivative, 22)
Show SMILES CCc1ccnc2c(cc(cc12)C(=O)N[C@@H](Cc1ccccc1)[C@H](O)CNCc1cccc(c1)C(F)(F)F)N1CCCC1=O |r|
Show InChI InChI=1S/C34H35F3N4O3/c1-2-24-13-14-39-32-27(24)18-25(19-29(32)41-15-7-12-31(41)43)33(44)40-28(17-22-8-4-3-5-9-22)30(42)21-38-20-23-10-6-11-26(16-23)34(35,36)37/h3-6,8-11,13-14,16,18-19,28,30,38,42H,2,7,12,15,17,20-21H2,1H3,(H,40,44)/t28-,30+/m0/s1
n/an/a 210n/an/an/an/a4.522
GSK
Assay Description
Enzyme activity and inhibition were assayed using a fluorescent FAM-[SEVNLDAEFK]-TAMRA substrate. Control reactions with no enzyme were included in e...
Bioorg Med Chem Lett 19: 3664-8 (2009)
Article DOI: 10.1016/j.bmcl.2009.03.165
BindingDB Entry DOI: 10.7270/Q2F18X23
3D
3D Structure (crystal)
Cathepsin D
(Homo sapiens (Human))
BDBM29768
(hydroxyethylamine derivative, 22)
Show SMILES CCc1ccnc2c(cc(cc12)C(=O)N[C@@H](Cc1ccccc1)[C@H](O)CNCc1cccc(c1)C(F)(F)F)N1CCCC1=O |r|
Show InChI InChI=1S/C34H35F3N4O3/c1-2-24-13-14-39-32-27(24)18-25(19-29(32)41-15-7-12-31(41)43)33(44)40-28(17-22-8-4-3-5-9-22)30(42)21-38-20-23-10-6-11-26(16-23)34(35,36)37/h3-6,8-11,13-14,16,18-19,28,30,38,42H,2,7,12,15,17,20-21H2,1H3,(H,40,44)/t28-,30+/m0/s1
NCI pathway
Reactome pathway
n/an/a 1.44E+4n/an/an/an/an/an/a
GSK
Assay Description
Enzyme activity and inhibition were assayed using a fluorescent FAM-[SEVNLDAEFK]-TAMRA substrate. Control reactions with no enzyme were included in e...
Bioorg Med Chem Lett 19: 3664-8 (2009)
Article DOI: 10.1016/j.bmcl.2009.03.165
BindingDB Entry DOI: 10.7270/Q2F18X23
Beta-secretase 2
(Homo sapiens (Human))
BDBM29768
(hydroxyethylamine derivative, 22)
Show SMILES CCc1ccnc2c(cc(cc12)C(=O)N[C@@H](Cc1ccccc1)[C@H](O)CNCc1cccc(c1)C(F)(F)F)N1CCCC1=O |r|
Show InChI InChI=1S/C34H35F3N4O3/c1-2-24-13-14-39-32-27(24)18-25(19-29(32)41-15-7-12-31(41)43)33(44)40-28(17-22-8-4-3-5-9-22)30(42)21-38-20-23-10-6-11-26(16-23)34(35,36)37/h3-6,8-11,13-14,16,18-19,28,30,38,42H,2,7,12,15,17,20-21H2,1H3,(H,40,44)/t28-,30+/m0/s1
n/an/a 1.32E+4n/an/an/an/an/an/a
GSK
Assay Description
Enzyme activity and inhibition were assayed using a fluorescent FAM-[SEVNLDAEFK]-TAMRA substrate. Control reactions with no enzyme were included in e...
Bioorg Med Chem Lett 19: 3664-8 (2009)
Article DOI: 10.1016/j.bmcl.2009.03.165
BindingDB Entry DOI: 10.7270/Q2F18X23