BDBM29770 hydroxyethylamine derivative, 25
SMILES: CCNc1cc(cc(c1)C(=O)N[C@@H](Cc1ccccc1)[C@H](O)CNC(C)(C)c1cccc(c1)C(F)(F)F)N1CCCCS1(=O)=O
InChI Key: InChIKey=LQKSXPXJHUCHMO-XZWHSSHBSA-N
Data: 3 IC50
Activity Spreadsheet -- Enzyme Inhibition Constant Data from BindingDB
Found 3 hits for monomerid = 29770
Trg + Lig
Ki
nM
ΔG°
kcal/mole
IC50
nM
Kd
nM
EC50/IC50
nM
koff
s-1
kon
M-1s-1
pHTemp
°C
Beta-secretase 1
(Homo sapiens (Human))
BDBM29770
(hydroxyethylamine derivative, 25)
Show SMILES CCNc1cc(cc(c1)C(=O)N[C@@H](Cc1ccccc1)[C@H](O)CNC(C)(C)c1cccc(c1)C(F)(F)F)N1CCCCS1(=O)=O |r|
Show InChI InChI=1S/C33H41F3N4O4S/c1-4-37-27-18-24(19-28(21-27)40-15-8-9-16-45(40,43)44)31(42)39-29(17-23-11-6-5-7-12-23)30(41)22-38-32(2,3)25-13-10-14-26(20-25)33(34,35)36/h5-7,10-14,18-21,29-30,37-38,41H,4,8-9,15-17,22H2,1-3H3,(H,39,42)/t29-,30+/m0/s1
n/an/a 6n/an/an/an/a4.522
GSK
Assay Description
Enzyme activity and inhibition were assayed using a fluorescent FAM-[SEVNLDAEFK]-TAMRA substrate. Control reactions with no enzyme were included in e...
Bioorg Med Chem Lett 19: 3664-8 (2009)
Article DOI: 10.1016/j.bmcl.2009.03.165
BindingDB Entry DOI: 10.7270/Q2F18X23
Cathepsin D
(Homo sapiens (Human))
BDBM29770
(hydroxyethylamine derivative, 25)
Show SMILES CCNc1cc(cc(c1)C(=O)N[C@@H](Cc1ccccc1)[C@H](O)CNC(C)(C)c1cccc(c1)C(F)(F)F)N1CCCCS1(=O)=O |r|
Show InChI InChI=1S/C33H41F3N4O4S/c1-4-37-27-18-24(19-28(21-27)40-15-8-9-16-45(40,43)44)31(42)39-29(17-23-11-6-5-7-12-23)30(41)22-38-32(2,3)25-13-10-14-26(20-25)33(34,35)36/h5-7,10-14,18-21,29-30,37-38,41H,4,8-9,15-17,22H2,1-3H3,(H,39,42)/t29-,30+/m0/s1
NCI pathway
Reactome pathway
n/an/a 600n/an/an/an/an/an/a
GSK
Assay Description
Enzyme activity and inhibition were assayed using a fluorescent FAM-[SEVNLDAEFK]-TAMRA substrate. Control reactions with no enzyme were included in e...
Bioorg Med Chem Lett 19: 3664-8 (2009)
Article DOI: 10.1016/j.bmcl.2009.03.165
BindingDB Entry DOI: 10.7270/Q2F18X23
Beta-secretase 2
(Homo sapiens (Human))
BDBM29770
(hydroxyethylamine derivative, 25)
Show SMILES CCNc1cc(cc(c1)C(=O)N[C@@H](Cc1ccccc1)[C@H](O)CNC(C)(C)c1cccc(c1)C(F)(F)F)N1CCCCS1(=O)=O |r|
Show InChI InChI=1S/C33H41F3N4O4S/c1-4-37-27-18-24(19-28(21-27)40-15-8-9-16-45(40,43)44)31(42)39-29(17-23-11-6-5-7-12-23)30(41)22-38-32(2,3)25-13-10-14-26(20-25)33(34,35)36/h5-7,10-14,18-21,29-30,37-38,41H,4,8-9,15-17,22H2,1-3H3,(H,39,42)/t29-,30+/m0/s1
n/an/a 350n/an/an/an/an/an/a
GSK
Assay Description
Enzyme activity and inhibition were assayed using a fluorescent FAM-[SEVNLDAEFK]-TAMRA substrate. Control reactions with no enzyme were included in e...
Bioorg Med Chem Lett 19: 3664-8 (2009)
Article DOI: 10.1016/j.bmcl.2009.03.165
BindingDB Entry DOI: 10.7270/Q2F18X23