BDBM297815 (−)-trans-3-Chloro-7-(2-methylpiperidin-4-yl)pyrazolo[1,5-a]pyrimidin-5(4H)-one hydrochloride::US10118930, Example 40
SMILES: CC1CC(CCN1)c1cc(=O)[nH]c2c(Cl)cnn12
InChI Key:
Data: 1 IC50
Activity Spreadsheet -- Enzyme Inhibition Constant Data from BindingDB
Found 1 hit for monomerid = 297815
Trg + Lig
Ki
nM
ΔG°
kcal/mole
IC50
nM
Kd
nM
EC50/IC50
nM
koff
s-1
kon
M-1s-1
pHTemp
°C
Tissue-type plasminogen activator
(Homo sapiens (Human))
BDBM297815
((−)-trans-3-Chloro-7-(2-methylpiperidin-4-yl...)
Show SMILES CC1CC(CCN1)c1cc(=O)[nH]c2c(Cl)cnn12
NCI pathway
Reactome pathway
US Patent
n/an/a 14n/an/an/an/an/an/a
BAYER PHARMA AKTIENGESELLSCHAFT
US Patent
Assay Description
The clot-lysis test system configures the kinetics of clot formation and degradation in vitro and allows quantifying modulation of the process by sel...
US Patent US10118930 (2018)
BindingDB Entry DOI: 10.7270/Q2QC05J5