BDBM29805 sulfone tricyclic analogue, 18
SMILES: CCc1cn2CCS(=O)(=O)Oc3cc(cc1c23)C(=O)N[C@@H](Cc1ccccc1)[C@H](O)CNCc1cccc(c1)C(F)(F)F
InChI Key: InChIKey=FYARDFZESROLIJ-RRPNLBNLSA-N
Data: 3 IC50
Activity Spreadsheet -- Enzyme Inhibition Constant Data from BindingDB
Found 3 hits for monomerid = 29805
Trg + Lig
Ki
nM
ΔG°
kcal/mole
IC50
nM
Kd
nM
EC50/IC50
nM
koff
s-1
kon
M-1s-1
pHTemp
°C
Beta-secretase 1
(Homo sapiens (Human))
BDBM29805
(sulfone tricyclic analogue, 18)
Show SMILES CCc1cn2CCS(=O)(=O)Oc3cc(cc1c23)C(=O)N[C@@H](Cc1ccccc1)[C@H](O)CNCc1cccc(c1)C(F)(F)F |r|
Show InChI InChI=1S/C31H32F3N3O5S/c1-2-22-19-37-11-12-43(40,41)42-28-16-23(15-25(22)29(28)37)30(39)36-26(14-20-7-4-3-5-8-20)27(38)18-35-17-21-9-6-10-24(13-21)31(32,33)34/h3-10,13,15-16,19,26-27,35,38H,2,11-12,14,17-18H2,1H3,(H,36,39)/t26-,27+/m0/s1
n/an/a 8n/an/an/an/a4.522
GSK
Assay Description
Enzyme activity and inhibition were assayed using a fluorescent FAM-[SEVNLDAEFK]-TAMRA substrate. Control reactions with no enzyme were included in e...
Bioorg Med Chem Lett 19: 3674-8 (2009)
Article DOI: 10.1016/j.bmcl.2009.03.149
BindingDB Entry DOI: 10.7270/Q25H7DKK
Beta-secretase 2
(Homo sapiens (Human))
BDBM29805
(sulfone tricyclic analogue, 18)
Show SMILES CCc1cn2CCS(=O)(=O)Oc3cc(cc1c23)C(=O)N[C@@H](Cc1ccccc1)[C@H](O)CNCc1cccc(c1)C(F)(F)F |r|
Show InChI InChI=1S/C31H32F3N3O5S/c1-2-22-19-37-11-12-43(40,41)42-28-16-23(15-25(22)29(28)37)30(39)36-26(14-20-7-4-3-5-8-20)27(38)18-35-17-21-9-6-10-24(13-21)31(32,33)34/h3-10,13,15-16,19,26-27,35,38H,2,11-12,14,17-18H2,1H3,(H,36,39)/t26-,27+/m0/s1
n/an/a 260n/an/an/an/an/an/a
GSK
Assay Description
Enzyme activity and inhibition were assayed using a fluorescent FAM-[SEVNLDAEFK]-TAMRA substrate. Control reactions with no enzyme were included in e...
Bioorg Med Chem Lett 19: 3674-8 (2009)
Article DOI: 10.1016/j.bmcl.2009.03.149
BindingDB Entry DOI: 10.7270/Q25H7DKK
Cathepsin D
(Homo sapiens (Human))
BDBM29805
(sulfone tricyclic analogue, 18)
Show SMILES CCc1cn2CCS(=O)(=O)Oc3cc(cc1c23)C(=O)N[C@@H](Cc1ccccc1)[C@H](O)CNCc1cccc(c1)C(F)(F)F |r|
Show InChI InChI=1S/C31H32F3N3O5S/c1-2-22-19-37-11-12-43(40,41)42-28-16-23(15-25(22)29(28)37)30(39)36-26(14-20-7-4-3-5-8-20)27(38)18-35-17-21-9-6-10-24(13-21)31(32,33)34/h3-10,13,15-16,19,26-27,35,38H,2,11-12,14,17-18H2,1H3,(H,36,39)/t26-,27+/m0/s1
NCI pathway
Reactome pathway
n/an/a 2.16E+3n/an/an/an/a4.522
GSK
Assay Description
Enzyme activity and inhibition were assayed using a fluorescent FAM-[SEVNLDAEFK]-TAMRA substrate. Control reactions with no enzyme were included in e...
Bioorg Med Chem Lett 19: 3674-8 (2009)
Article DOI: 10.1016/j.bmcl.2009.03.149
BindingDB Entry DOI: 10.7270/Q25H7DKK