BDBM298061 3-(5-methyl-4-phenyl-1,3-thiazol-2-yl)-7-(piperidin-4-yl)pyrazolo[1,5-c]pyrimidin-5(4H)-one hydrochloride::US10118930, Example 272
SMILES: Cc1sc(nc1-c1ccccc1)-c1cnn2c(cc(=O)[nH]c12)C1CCNCC1
InChI Key: InChIKey=FXQRRJUAEFIBPY-UHFFFAOYSA-N
Data: 1 IC50
Activity Spreadsheet -- Enzyme Inhibition Constant Data from BindingDB
Found 1 hit for monomerid = 298061
Trg + Lig
Ki
nM
ΔG°
kcal/mole
IC50
nM
Kd
nM
EC50/IC50
nM
koff
s-1
kon
M-1s-1
pHTemp
°C
Tissue-type plasminogen activator
(Homo sapiens (Human))
BDBM298061
(3-(5-methyl-4-phenyl-1,3-thiazol-2-yl)-7-(piperidi...)
Show SMILES Cc1sc(nc1-c1ccccc1)-c1cnn2c(cc(=O)[nH]c12)C1CCNCC1
Show InChI InChI=1S/C21H21N5OS/c1-13-19(15-5-3-2-4-6-15)25-21(28-13)16-12-23-26-17(11-18(27)24-20(16)26)14-7-9-22-10-8-14/h2-6,11-12,14,22H,7-10H2,1H3,(H,24,27)
NCI pathway
Reactome pathway
US Patent
n/an/a 13n/an/an/an/an/an/a
BAYER PHARMA AKTIENGESELLSCHAFT
US Patent
Assay Description
The clot-lysis test system configures the kinetics of clot formation and degradation in vitro and allows quantifying modulation of the process by sel...
US Patent US10118930 (2018)
BindingDB Entry DOI: 10.7270/Q2QC05J5