BDBM298098 3-(4-ethyl-1,3-thiazol-2-yl)-7-(piperidin-4-yl)pyrazolo[1,5-a]pyrimidin-5(4H)-one hydrochloride::US10118930, Example 308
SMILES: CCc1csc(n1)-c1cnn2c(cc(=O)[nH]c12)C1CCNCC1
InChI Key: InChIKey=PLKPIFPTSOXFOO-UHFFFAOYSA-N
Data: 1 IC50
Activity Spreadsheet -- Enzyme Inhibition Constant Data from BindingDB
Found 1 hit for monomerid = 298098
Trg + Lig
Ki
nM
ΔG°
kcal/mole
IC50
nM
Kd
nM
EC50/IC50
nM
koff
s-1
kon
M-1s-1
pHTemp
°C
Tissue-type plasminogen activator
(Homo sapiens (Human))
BDBM298098
(3-(4-ethyl-1,3-thiazol-2-yl)-7-(piperidin-4-yl)pyr...)
Show SMILES CCc1csc(n1)-c1cnn2c(cc(=O)[nH]c12)C1CCNCC1
Show InChI InChI=1S/C16H19N5OS/c1-2-11-9-23-16(19-11)12-8-18-21-13(7-14(22)20-15(12)21)10-3-5-17-6-4-10/h7-10,17H,2-6H2,1H3,(H,20,22)
NCI pathway
Reactome pathway
US Patent
n/an/a 11n/an/an/an/an/an/a
BAYER PHARMA AKTIENGESELLSCHAFT
US Patent
Assay Description
The clot-lysis test system configures the kinetics of clot formation and degradation in vitro and allows quantifying modulation of the process by sel...
US Patent US10118930 (2018)
BindingDB Entry DOI: 10.7270/Q2QC05J5