BDBM298127 3-(5-tert-butyl-1,3,4-oxadiazol-2-yl)-2-methyl-7-(piperidin-4-yl)pyrazolo[1,5-a]pyrimidin-5(4H)-one hydrochloride::US10118930, Example 338
SMILES: Cc1nn2c(cc(=O)[nH]c2c1-c1nnc(o1)C(C)(C)C)C1CCNCC1
InChI Key: InChIKey=BUBFTEVTMRTWON-UHFFFAOYSA-N
Data: 1 IC50
Activity Spreadsheet -- Enzyme Inhibition Constant Data from BindingDB
Found 1 hit for monomerid = 298127
Trg + Lig
Ki
nM
ΔG°
kcal/mole
IC50
nM
Kd
nM
EC50/IC50
nM
koff
s-1
kon
M-1s-1
pHTemp
°C
Tissue-type plasminogen activator
(Homo sapiens (Human))
BDBM298127
(3-(5-tert-butyl-1,3,4-oxadiazol-2-yl)-2-methyl-7-(...)
Show SMILES Cc1nn2c(cc(=O)[nH]c2c1-c1nnc(o1)C(C)(C)C)C1CCNCC1
Show InChI InChI=1S/C18H24N6O2/c1-10-14(16-21-22-17(26-16)18(2,3)4)15-20-13(25)9-12(24(15)23-10)11-5-7-19-8-6-11/h9,11,19H,5-8H2,1-4H3,(H,20,25)
NCI pathway
Reactome pathway
US Patent
n/an/a 11n/an/an/an/an/an/a
BAYER PHARMA AKTIENGESELLSCHAFT
US Patent
Assay Description
The clot-lysis test system configures the kinetics of clot formation and degradation in vitro and allows quantifying modulation of the process by sel...
US Patent US10118930 (2018)
BindingDB Entry DOI: 10.7270/Q2QC05J5