BDBM29883 alkynyl ether, 25
SMILES: C[C@H](O)C#CCOc1cc(COc2ccc(cc2)C(F)(F)F)ccc1Sc1ccc(OCC(O)=O)c2CCCCc12
InChI Key: InChIKey=BHFPIRBQUYNQBU-FQEVSTJZSA-N
Data: 3 KI  3 EC50
Activity Spreadsheet -- Enzyme Inhibition Constant Data from BindingDB
Found 3 hits for monomerid = 29883
Trg + Lig
Ki
nM
ΔG°
kcal/mole
IC50
nM
Kd
nM
EC50/IC50
nM
koff
s-1
kon
M-1s-1
pHTemp
°C
Peroxisome proliferator-activated receptor delta
(Homo sapiens (Human))
BDBM29883
(alkynyl ether, 25)
Show SMILES C[C@H](O)C#CCOc1cc(COc2ccc(cc2)C(F)(F)F)ccc1Sc1ccc(OCC(O)=O)c2CCCCc12 |r|
Show InChI InChI=1S/C31H29F3O6S/c1-20(35)5-4-16-38-27-17-21(18-39-23-11-9-22(10-12-23)31(32,33)34)8-14-29(27)41-28-15-13-26(40-19-30(36)37)24-6-2-3-7-25(24)28/h8-15,17,20,35H,2-3,6-7,16,18-19H2,1H3,(H,36,37)/t20-/m0/s1
6n/an/an/a 1.20E+3n/an/an/an/a
Amgen
Assay Description
The human PPARdelta ligand binding was directly measured using a scintillation proximity assay. Plates were read on a Packard TopCount. IC50 values f...
Bioorg Med Chem Lett 19: 3550-4 (2009)
Article DOI: 10.1016/j.bmcl.2009.04.151
BindingDB Entry DOI: 10.7270/Q2NK3CC0
Peroxisome proliferator-activated receptor gamma
(Homo sapiens (Human))
BDBM29883
(alkynyl ether, 25)
Show SMILES C[C@H](O)C#CCOc1cc(COc2ccc(cc2)C(F)(F)F)ccc1Sc1ccc(OCC(O)=O)c2CCCCc12 |r|
Show InChI InChI=1S/C31H29F3O6S/c1-20(35)5-4-16-38-27-17-21(18-39-23-11-9-22(10-12-23)31(32,33)34)8-14-29(27)41-28-15-13-26(40-19-30(36)37)24-6-2-3-7-25(24)28/h8-15,17,20,35H,2-3,6-7,16,18-19H2,1H3,(H,36,37)/t20-/m0/s1
NCI pathway
Reactome pathway
79n/an/an/a 3.30E+3n/an/an/an/a
Amgen
Assay Description
The human PPARgamma ligand binding was directly measured using a filtration assay in a UniFilter 350 96-well assay plate (Polyfiltronics). The reacti...
Bioorg Med Chem Lett 19: 3550-4 (2009)
Article DOI: 10.1016/j.bmcl.2009.04.151
BindingDB Entry DOI: 10.7270/Q2NK3CC0
Peroxisome proliferator-activated receptor alpha
(Homo sapiens (Human))
BDBM29883
(alkynyl ether, 25)
Show SMILES C[C@H](O)C#CCOc1cc(COc2ccc(cc2)C(F)(F)F)ccc1Sc1ccc(OCC(O)=O)c2CCCCc12 |r|
Show InChI InChI=1S/C31H29F3O6S/c1-20(35)5-4-16-38-27-17-21(18-39-23-11-9-22(10-12-23)31(32,33)34)8-14-29(27)41-28-15-13-26(40-19-30(36)37)24-6-2-3-7-25(24)28/h8-15,17,20,35H,2-3,6-7,16,18-19H2,1H3,(H,36,37)/t20-/m0/s1
2.90E+3 -7.47n/an/a>1.00E+5n/an/a7.122
Amgen
Assay Description
The human PPARalpha ligand binding was directly measured using a scintillation proximity assay. Plates were read on a Packard TopCount. IC50 values f...
Bioorg Med Chem Lett 19: 3550-4 (2009)
Article DOI: 10.1016/j.bmcl.2009.04.151
BindingDB Entry DOI: 10.7270/Q2NK3CC0