BDBM29898 substituted 6-aminoquinoline-3-carbonitrile, 9
SMILES: CC(C)(C)n1cc(CNc2cc(Cl)c3ncc(C#N)c(Nc4ccc(F)c(Cl)c4)c3c2)nn1
InChI Key: InChIKey=SRNSJXJGQHZBMC-UHFFFAOYSA-N
Data: 1 IC50
Activity Spreadsheet -- Enzyme Inhibition Constant Data from BindingDB
Found 1 hit for monomerid = 29898
Trg + Lig
Ki
nM
ΔG°
kcal/mole
IC50
nM
Kd
nM
EC50/IC50
nM
koff
s-1
kon
M-1s-1
pHTemp
°C
Mitogen-activated protein kinase kinase kinase 8
(Homo sapiens (Human))
BDBM29898
(substituted 6-aminoquinoline-3-carbonitrile, 9)
Show SMILES CC(C)(C)n1cc(CNc2cc(Cl)c3ncc(C#N)c(Nc4ccc(F)c(Cl)c4)c3c2)nn1
Show InChI InChI=1S/C23H20Cl2FN7/c1-23(2,3)33-12-16(31-32-33)11-28-15-6-17-21(30-14-4-5-20(26)18(24)7-14)13(9-27)10-29-22(17)19(25)8-15/h4-8,10,12,28H,11H2,1-3H3,(H,29,30)
NCI pathway
Reactome pathway
n/an/a 170n/an/an/an/a7.230
Wyeth Research
Assay Description
Tpl2/Cot activity was directly assayed using GST-MEK1 as a substrate. The phosphorylation on serine residues 217 and 221 of GST-MEK1 was detected by ...
Bioorg Med Chem Lett 19: 3485-8 (2009)
Article DOI: 10.1016/j.bmcl.2009.05.009
BindingDB Entry DOI: 10.7270/Q2HT2MN8